{"text_format":"2","workbook":"xlsx","n_sheets":7,"sheets":["Pontozólaphoz","Osszesitohoz","zsűri megjegyzései","Template-pontoz","Template-osszesit","Zsuri","Helyezesek_SZTE_AOK"],"not_rendered":{"charts":0,"images":0,"macros":0,"external_links":0,"defined_names":3,"comments":2,"pivot_tables":0},"unopened":[],"bounds":{"document_bytes":16777216,"sheet_cells":100000,"run_cost":"one","rows_first":2000,"rows_last":500,"rows_between":2000,"halvings":0,"cell_chars":16384,"cell_head_chars":4096},"cells_cut":0,"cells_raw":0,"read":"whole","date_system":"1900"}

{"sheet":"Pontozólaphoz","index":0,"n_rows":521,"n_cols":13,"rows_kept":521,"cut":false,"hidden":true,"merged":[[6,6,6,12],[61,6,61,12],[363,6,363,12],[478,6,478,12],[48,6,48,12],[94,6,94,12],[16,6,16,12]]}
["sorsz","Beosztott tagozat","Tagozatkód","Sorszám","Szerző(k)","Pályamunka címe",{"$f":"\"A: Absztrakt\"&CHAR(10)&\"(0-5 pont)\"","v":"A: Absztrakt\n(0-5 pont)"},{"$f":"\"B: Szakmai tartalom\"&CHAR(10)&\"(0-15 pont)\"","v":"B: Szakmai tartalom\n(0-15 pont)"},{"$f":"\"C: Előadói stílus\"&CHAR(10)&\"(0-10 pont)\"","v":"C: Előadói stílus\n(0-10 pont)"},{"$f":"\"D: Szemléltető eszközök használata, humán demonstráció \"&CHAR(10)&\"(0-10 pont)\"","v":"D: Szemléltető eszközök használata, humán demonstráció \n(0-10 pont)"},{"$f":"\"E: Vitakészség és szakmai kompetencia\"&CHAR(10)&\"(0-10 pont)\"","v":"E: Vitakészség és szakmai kompetencia\n(0-10 pont)"},{"$f":"\"F: Kötelező pontlevonások\"&CHAR(10)&\"(Függelék dia hiánya, 30 mp-t meghaladó időtúllépés)\"","v":"F: Kötelező pontlevonások\n(Függelék dia hiánya, 30 mp-t meghaladó időtúllépés)"},{"$f":"\"Összpontszám\"&CHAR(10)&\"(0-50 pont)\"&CHAR(10)&\"=A+B+C+D+E-F\"","v":"Összpontszám\n(0-50 pont)\n=A+B+C+D+E-F"}]
["2.","Egészségtudományok - Egészségügyi szervezés és menedzsment",{"$f":"VLOOKUP(B2,#REF!,2,FALSE)","v":{"$error":"#REF!"}},1,"Kajos Luca Fanni\nPTE - ETK","Különböző feltárásokkal végzett csípőízületi endoprotetizált betegek rövid és hosszútávú életminőségének vizsgálata a magán és állami ellátási szektor vonatkozásában"," "," "," "," ",null,null,{"$f":"SUM(G2:K2)-L2","v":0}]
["4.","Egészségtudományok - Egészségügyi szervezés és menedzsment",{"$f":"VLOOKUP(B3,#REF!,2,FALSE)","v":{"$error":"#REF!"}},2,"Kovács Dóra\nGFE - ESZK","A lovaglás jótékony hatásainak jelentősége a sport választásánál",{"$nulls":6},{"$f":"SUM(G3:K3)-L3","v":0}]
["1.","Egészségtudományok - Egészségügyi szervezés és menedzsment",{"$f":"VLOOKUP(B4,#REF!,2,FALSE)","v":{"$error":"#REF!"}},3,"Palotás Petra Anita\nGFE - ESZK","Alternatív terápiás eljárások Magyarországon",{"$nulls":6},0]
["86.","Egészségtudományok - Egészségügyi szervezés és menedzsment",{"$f":"VLOOKUP(B5,#REF!,2,FALSE)","v":{"$error":"#REF!"}},4,"Pigniczki Péter Pál\nSZTE - ETSZK","Hazai adatok a Myasthenia Gravisban szenvedő betegekről",{"$nulls":6},0]
["3.","Egészségtudományok - Egészségügyi szervezés és menedzsment",{"$f":"VLOOKUP(B6,#REF!,2,FALSE)","v":{"$error":"#REF!"}},5,"Sami Anett Anna\nME - EK","A 21. századi holisztikus egészségtudatosság jelenlétének vizsgálata a munkahelyi környezetben",{"$nulls":6},0]
["5.","Egészségtudományok - Egészségügyi szervezés és menedzsment",{"$f":"VLOOKUP(B7,#REF!,2,FALSE)","v":{"$error":"#REF!"}},6,"Varga Henrietta-Réka\nRO EMTE - MVK","Szexuális felvilágosultság az általános iskolások körében","Nem jelent meg"]
["12.","Egészségtudományok - Képalkotó diagnosztikai analitika",{"$f":"VLOOKUP(B8,#REF!,2,FALSE)","v":{"$error":"#REF!"}},1,"Antal Szabolcs István\nSZTE - ÁOK","Fokozott nyugalmi aktivitás a fehérállományi léziókban sclerosis multiplexesben",{"$nulls":6},0]
["6.","Egészségtudományok - Képalkotó diagnosztikai analitika",{"$f":"VLOOKUP(B9,#REF!,2,FALSE)","v":{"$error":"#REF!"}},2,"Bolla Gergő Levente\nME - EK","Dixon típusú, frekvencia alapú zsírelnyomásos MR szekvencia klinikai alkalmazhatósága",{"$nulls":6},0]
["9.","Egészségtudományok - Képalkotó diagnosztikai analitika",{"$f":"VLOOKUP(B10,#REF!,2,FALSE)","v":{"$error":"#REF!"}},3,"Fábián János Krisztián\nPTE - ETK","18F-FDOPA PET SUVmax paraméterének összefüggése; nem, életkor és szövettan viszonylatában",{"$nulls":6},0]
["13.","Egészségtudományok - Képalkotó diagnosztikai analitika",{"$f":"VLOOKUP(B11,#REF!,2,FALSE)","v":{"$error":"#REF!"}},4,"Gráczer Kitti\nME - EK","Nagyízületi protézisek vizsgálata szcintigráfiás módszerekkel",{"$nulls":6},0]
["8.","Egészségtudományok - Képalkotó diagnosztikai analitika",{"$f":"VLOOKUP(B12,#REF!,2,FALSE)","v":{"$error":"#REF!"}},5,"Kövesdi Orsolya Liza\nPTE - ETK","18F-FDG PET/MR prediktív érték vizsgálat kemoradioterápiával kezelt fej-nyak daganatos betegeknél",{"$nulls":6},0]
["10.","Egészségtudományok - Képalkotó diagnosztikai analitika",{"$f":"VLOOKUP(B13,#REF!,2,FALSE)","v":{"$error":"#REF!"}},6,"Szűcs Dániel István\nME - EK","Vírus eredetű tüdőbetegségek képalkotó differenciál diagnosztikája gyermek és felnőtt korban",{"$nulls":6},0]
["16.","Egészségtudományok - Klinikai és elméleti epidemiológia 1.",{"$f":"VLOOKUP(B14,#REF!,2,FALSE)","v":{"$error":"#REF!"}},1,"Abou Hamdah Ali\nDE - NK","The Prevalence and risk factors of Major Depressive Disorder (MDD) among Syrians in Damascus and Damascus Suburb",{"$nulls":6},0]
["17.","Egészségtudományok - Klinikai és elméleti epidemiológia 1.",{"$f":"VLOOKUP(B15,#REF!,2,FALSE)","v":{"$error":"#REF!"}},2,"Bokor Laura\nSE - ÁOK","A COVID-19 pandémia első hullámának másodlagos hatása és következményei a miokardiális infarktus ellátásában",{"$nulls":6},0]
{"$rows_left_out":507}
{"sheet":"Osszesitohoz","index":1,"n_rows":521,"n_cols":15,"rows_kept":521,"cut":false,"hidden":true,"merged":[[6,7,6,14],[61,7,61,14],[363,7,363,14],[48,7,48,14],[478,7,478,14],[94,7,94,14],[16,7,16,14]]}
["sorsz","Beosztott tagozat","Tagozatkód","Sorszám","Szerző(k)","Pályamunka címe","Pályamunka azonosítószáma","DE","PTE","SE","SZTE","Külső","Átlag","Helyezés","Végleges díjazás"]
["2.","Egészségtudományok - Egészségügyi szervezés és menedzsment",{"$f":"VLOOKUP(B2,#REF!,2,FALSE)","v":{"$error":"#REF!"}},1,"Kajos Luca Fanni\nPTE - ETK","Különböző feltárásokkal végzett csípőízületi endoprotetizált betegek rövid és hosszútávú életminőségének vizsgálata a magán és állami ellátási szektor vonatkozásában","PTE-ETK/12/040"," "," "," "," ",null,{"$f":"AVERAGE(H2:L2)","v":{"$error":"#DIV/0!"}},{"$f":"_xlfn.RANK.EQ(M2,M:M)","v":{"$error":"#DIV/0!"}}]
["4.","Egészségtudományok - Egészségügyi szervezés és menedzsment",{"$f":"VLOOKUP(B3,#REF!,2,FALSE)","v":{"$error":"#REF!"}},2,"Kovács Dóra\nGFE - ESZK","A lovaglás jótékony hatásainak jelentősége a sport választásánál","GFE-ESZK/12/001",{"$nulls":5},{"$f":"AVERAGE(H3:L3)","v":{"$error":"#DIV/0!"}},{"$f":"_xlfn.RANK.EQ(M3,M:M)","v":{"$error":"#DIV/0!"}}]
["1.","Egészségtudományok - Egészségügyi szervezés és menedzsment",{"$f":"VLOOKUP(B4,#REF!,2,FALSE)","v":{"$error":"#REF!"}},3,"Palotás Petra Anita\nGFE - ESZK","Alternatív terápiás eljárások Magyarországon","GFE-ESZK/12/003",{"$nulls":5},{"$error":"#DIV/0!"},{"$error":"#DIV/0!"}]
["86.","Egészségtudományok - Egészségügyi szervezés és menedzsment",{"$f":"VLOOKUP(B5,#REF!,2,FALSE)","v":{"$error":"#REF!"}},4,"Pigniczki Péter Pál\nSZTE - ETSZK","Hazai adatok a Myasthenia Gravisban szenvedő betegekről","SZTE-ETSZK/12/004",{"$nulls":5},{"$error":"#DIV/0!"},{"$error":"#DIV/0!"}]
["3.","Egészségtudományok - Egészségügyi szervezés és menedzsment",{"$f":"VLOOKUP(B6,#REF!,2,FALSE)","v":{"$error":"#REF!"}},5,"Sami Anett Anna\nME - EK","A 21. századi holisztikus egészségtudatosság jelenlétének vizsgálata a munkahelyi környezetben","ME-EK/12/011",{"$nulls":5},{"$error":"#DIV/0!"},{"$error":"#DIV/0!"}]
["5.","Egészségtudományok - Egészségügyi szervezés és menedzsment",{"$f":"VLOOKUP(B7,#REF!,2,FALSE)","v":{"$error":"#REF!"}},6,"Varga Henrietta-Réka\nRO EMTE - MVK","Szexuális felvilágosultság az általános iskolások körében","RO EMTE-MVK/12/001","Nem jelent meg"]
["12.","Egészségtudományok - Képalkotó diagnosztikai analitika",{"$f":"VLOOKUP(B8,#REF!,2,FALSE)","v":{"$error":"#REF!"}},1,"Antal Szabolcs István\nSZTE - ÁOK","Fokozott nyugalmi aktivitás a fehérállományi léziókban sclerosis multiplexesben","SZTE-ÁOK/12/071",{"$nulls":5},{"$error":"#DIV/0!"},{"$error":"#DIV/0!"}]
["6.","Egészségtudományok - Képalkotó diagnosztikai analitika",{"$f":"VLOOKUP(B9,#REF!,2,FALSE)","v":{"$error":"#REF!"}},2,"Bolla Gergő Levente\nME - EK","Dixon típusú, frekvencia alapú zsírelnyomásos MR szekvencia klinikai alkalmazhatósága","ME-EK/12/002",{"$nulls":5},{"$error":"#DIV/0!"},{"$error":"#DIV/0!"}]
["9.","Egészségtudományok - Képalkotó diagnosztikai analitika",{"$f":"VLOOKUP(B10,#REF!,2,FALSE)","v":{"$error":"#REF!"}},3,"Fábián János Krisztián\nPTE - ETK","18F-FDOPA PET SUVmax paraméterének összefüggése; nem, életkor és szövettan viszonylatában","PTE-ETK/12/038",{"$nulls":5},{"$error":"#DIV/0!"},{"$error":"#DIV/0!"}]
["13.","Egészségtudományok - Képalkotó diagnosztikai analitika",{"$f":"VLOOKUP(B11,#REF!,2,FALSE)","v":{"$error":"#REF!"}},4,"Gráczer Kitti\nME - EK","Nagyízületi protézisek vizsgálata szcintigráfiás módszerekkel","ME-EK/12/010",{"$nulls":5},{"$error":"#DIV/0!"},{"$error":"#DIV/0!"}]
["8.","Egészségtudományok - Képalkotó diagnosztikai analitika",{"$f":"VLOOKUP(B12,#REF!,2,FALSE)","v":{"$error":"#REF!"}},5,"Kövesdi Orsolya Liza\nPTE - ETK","18F-FDG PET/MR prediktív érték vizsgálat kemoradioterápiával kezelt fej-nyak daganatos betegeknél","PTE-ETK/12/015",{"$nulls":5},{"$error":"#DIV/0!"},{"$error":"#DIV/0!"}]
["10.","Egészségtudományok - Képalkotó diagnosztikai analitika",{"$f":"VLOOKUP(B13,#REF!,2,FALSE)","v":{"$error":"#REF!"}},6,"Szűcs Dániel István\nME - EK","Vírus eredetű tüdőbetegségek képalkotó differenciál diagnosztikája gyermek és felnőtt korban","ME-EK/12/001",{"$nulls":5},{"$error":"#DIV/0!"},{"$error":"#DIV/0!"}]
["16.","Egészségtudományok - Klinikai és elméleti epidemiológia 1.",{"$f":"VLOOKUP(B14,#REF!,2,FALSE)","v":{"$error":"#REF!"}},1,"Abou Hamdah Ali\nDE - NK","The Prevalence and risk factors of Major Depressive Disorder (MDD) among Syrians in Damascus and Damascus Suburb","DE-NK/12/008",{"$nulls":5},{"$error":"#DIV/0!"},{"$error":"#DIV/0!"}]
["17.","Egészségtudományok - Klinikai és elméleti epidemiológia 1.",{"$f":"VLOOKUP(B15,#REF!,2,FALSE)","v":{"$error":"#REF!"}},2,"Bokor Laura\nSE - ÁOK","A COVID-19 pandémia első hullámának másodlagos hatása és következményei a miokardiális infarktus ellátásában","SE-ÁOK/12/072",{"$nulls":5},{"$error":"#DIV/0!"},{"$error":"#DIV/0!"}]
{"$rows_left_out":507}
{"sheet":"zsűri megjegyzései","index":2,"n_rows":78,"n_cols":2,"rows_kept":78,"cut":false,"hidden":true,"merged":[]}
["Beosztott tagozat"]
["Egészségtudományok - Egészségügyi szervezés és menedzsment"]
["Egészségtudományok - Képalkotó diagnosztikai analitika"]
["Egészségtudományok - Klinikai és elméleti epidemiológia 1."]
["Egészségtudományok - Klinikai és elméleti epidemiológia 2."]
["Egészségtudományok - Primer prevenció, védőnői prevenció, dietetika 1."]
["Egészségtudományok - Primer prevenció, védőnői prevenció, dietetika 2."]
["Egészségtudományok - Primer prevenció, védőnői prevenció, dietetika 3."]
["Egészségtudományok - Primer prevenció, védőnői prevenció, dietetika 4."]
["Egészségtudományok - Primer prevenció, védőnői prevenció, dietetika 5."]
["Egészségtudományok - Szekunder prevenció, családorvoslás, preventív medicina 1."]
["Egészségtudományok - Szekunder prevenció, családorvoslás, preventív medicina 2.","Zsűritagok javaslata alapján különdíja jelölt: Krishnan Rohan"]
["Egészségtudományok - Szekunder prevenció, családorvoslás, preventív medicina 3.","Különdíjra történő javaslat: Szikszai Alexandra"]
["Egészségtudományok - Tercier prevenció, fizioterápia, rehabilitáció, ápolás és betegellátás 1."]
["Egészségtudományok - Tercier prevenció, fizioterápia, rehabilitáció, ápolás és betegellátás 2.","Különdíjra jelölt: Meher Muhammad Zeeshan"]
{"$rows_left_out":64}
{"sheet":"Template-pontoz","index":3,"n_rows":6,"n_cols":10,"rows_kept":6,"cut":false,"hidden":true,"merged":[[0,0,0,9],[1,0,1,9],[2,0,2,9],[3,0,3,2]]}
["Pontozólap"]
[" 35. OTDK Orvos- és Egészségtudományi Szekció"]
["Kérjük a tisztelt zsűritagokat, hogy a hallgatónkénti összpontszámot a tagozat végén erre a célra kialakított Zoom csoportszobában a TDT által delegált jegyzőkönyv-hitelesítőnek diktálják be"]
[{"$f":"VLOOKUP($A$5,Zsuri!$A:$J,10,FALSE)&\" [Zoom]\"","v":"Nap+Hét [Zoom]"},null,null,{"$f":"VLOOKUP($A$5,Zsuri!$A:$K,9,FALSE)","v":"Nap"}]
["Tagozat"]
["Sorszám","Szerző(k)","Pályamunka címe","A: Absztrakt\n(0-5 pont)","B: Szakmai tartalom\n(0-15 pont)","C: Előadói stílus\n(0-10 pont)","D: Szemléltető eszközök használata, humán demonstráció \n(0-10 pont)","E: Vitakészség és szakmai kompetencia\n(0-10 pont)","F: Kötelező pontlevonások\n(Függelék dia hiánya, 30 mp-t meghaladó időtúllépés)","Összpontszám\n(0-50 pont)\n=A+B+C+D+E-F"]

{"sheet":"Template-osszesit","index":4,"n_rows":9,"n_cols":12,"rows_kept":9,"cut":false,"hidden":true,"merged":[[5,8,6,11],[4,8,4,11],[0,0,0,11],[1,0,1,11],[2,0,2,10],[3,0,3,10],[5,0,6,7],[4,0,4,2]]}
["Pontösszesítő jegyzőkönyv"]
[" 35. OTDK Orvos- és Egészségtudományi Szekció"]
["Kérjük a tisztelt zsűritagokat, hogy a hallgatónkénti összpontszámot a tagozat végén erre a célra kialakított Zoom csoportszobában a TDT által delegált jegyzőkönyv-hitelesítőnek diktálják be"]
["A tagozat eredményeit tartalmazó alábbi táblázattal a zsűri egyetért, annak hitelességét a zsűrielnök aláírásával igazolja."]
[{"$f":"VLOOKUP($A$8,Zsuri!$A:$J,10,FALSE)&\" [Zoom]\"","v":"Nap+Hét [Zoom]"},null,null,{"$f":"VLOOKUP($A$8,Zsuri!$A:$K,9,FALSE)","v":"Nap"}]
["A zsűrielnököt kérjük, hogy a táblázatot kinyomtatva, aláírásával hitelesítve, szkennelt formában juttassa el a tdk.aok@med.u-szeged.hu címre a tagozat zárását követő 2 napon belül.",{"$nulls":7},"….... (zsűrielnök)"]
[]
["Tagozat"]
["Sorszám","Szerző(k)","Pályamunka címe","Pályamunka azonosítószáma",{"$f":"VLOOKUP($A$8,Zsuri!$A:$G,5,FALSE)&CHAR(10)&\"(DE)\"","v":"DE\n(DE)"},{"$f":"VLOOKUP($A$8,Zsuri!$A:$G,7,FALSE)&CHAR(10)&\"(PTE)\"","v":"PTE\n(PTE)"},{"$f":"VLOOKUP($A$8,Zsuri!$A:$G,4,FALSE)&CHAR(10)&\"(SE)\"","v":"SE\n(SE)"},{"$f":"VLOOKUP($A$8,Zsuri!$A:$G,6,FALSE)&CHAR(10)&\"(SZTE)\"","v":"SZTE\n(SZTE)"},{"$f":"VLOOKUP($A$8,Zsuri!$A:$G,3,FALSE)&CHAR(10)&\"(Külső tag)\"","v":"Külső\n(Külső tag)"},"Átlag","Helyezés","Végleges díjazás"]

{"sheet":"Zsuri","index":5,"n_rows":78,"n_cols":10,"rows_kept":78,"cut":false,"hidden":true,"merged":[]}
["Tagozat","Előadók","Külső","SE","DE","SZTE","PTE","Időpont","Nap","Nap+Hét"]
["Egészségtudományok - Egészségügyi szervezés és menedzsment",6,"Bártfai Zoltán","Feith Helga Judit","Zsuga Judit","Buzás Norbert","Lampek Kinga","2021. április 7. (szerda) 08:00–09:30",{"$f":"MID(H2,SEARCH(\"(\",H2)+1,SEARCH(\")\",H2)-SEARCH(\"(\",H2)-1)","v":"szerda"},{"$f":"LEFT(H2,SEARCH(\"(\",H2)-1)&RIGHT(H2,LEN(H2)-SEARCH(\")\",H2)-1)","v":"2021. április 7. 08:00–09:30"}]
["Egészségtudományok - Képalkotó diagnosztikai analitika",6,"Várnagy Anna","Doros Attila","Berényi Ervin","Joó Gabriella","Kovács Árpád","2021. április 8. (csütörtök) 08:00–09.30",{"$f":"MID(H3,SEARCH(\"(\",H3)+1,SEARCH(\")\",H3)-SEARCH(\"(\",H3)-1)","v":"csütörtök"},{"$f":"LEFT(H3,SEARCH(\"(\",H3)-1)&RIGHT(H3,LEN(H3)-SEARCH(\")\",H3)-1)","v":"2021. április 8. 08:00–09.30"}]
["Egészségtudományok - Klinikai és elméleti epidemiológia 1.",7,"Fodor Bertalan","Pándics Tamás","Bíró Klára","Rózsa Éva","Szolcsányi Tibor","2021. április 7. (szerda) 13:00–14:45","szerda","2021. április 7. 13:00–14:45"]
["Egészségtudományok - Klinikai és elméleti epidemiológia 2.",8,"Fodor Bertalan","Bánhidy Ferenc ","Ádám Balázs","Kelemen Oguz","Szolcsányi Tibor","2021. április 7. (szerda) 15:30–17:45","szerda","2021. április 7. 15:30–17:45"]
["Egészségtudományok - Primer prevenció, védőnői prevenció, dietetika 1.",6,"Kissné Garajszki Ildikó","Veresné Bálint Márta","Veres-Balajti Ilona","Tobak Orsolya","Figler Mária","2021. április 6. (kedd) 13:00–14:30","kedd","2021. április 6. 13:00–14:30"]
["Egészségtudományok - Primer prevenció, védőnői prevenció, dietetika 2.",6,"Kissné Garajszki Ildikó","Veresné Bálint Márta","Veres-Balajti Ilona","Tobak Orsolya","Figler Mária","2021. április 6. (kedd) 15:15–16:45","kedd","2021. április 6. 15:15–16:45"]
["Egészségtudományok - Primer prevenció, védőnői prevenció, dietetika 3.",7,"Kissné Garajszki Ildikó","Veresné Bálint Márta","Lukács Balázs","Tobak Orsolya","Strómajer-Rácz Tímea","2021. április 7. (szerda) 10:15–12:00","szerda","2021. április 7. 10:15–12:00"]
["Egészségtudományok - Primer prevenció, védőnői prevenció, dietetika 4.",7,"Petrik Zita","Gadó Klára","Kardos László","Erdősi Erika","Tóth Miklós","2021. április 7. (szerda) 13:00–14:45","szerda","2021. április 7. 13:00–14:45"]
["Egészségtudományok - Primer prevenció, védőnői prevenció, dietetika 5.",7,"Petrik Zita","Gadó Klára","Kardos László","Erdősi Erika","Figler Mária","2021. április 7. (szerda) 15:30–17:15","szerda","2021. április 7. 15:30–17:15"]
["Egészségtudományok - Szekunder prevenció, családorvoslás, preventív medicina 1.",7,"Szabó Mónika","Szabó László","Balázs Margit","Szatmári Angelika","Lampek Kinga","2021. április 6. (kedd) 13:00–14:45","kedd","2021. április 6. 13:00–14:45"]
["Egészségtudományok - Szekunder prevenció, családorvoslás, preventív medicina 2.",7,"Szabó Mónika","Szabó László","Balázs Margit","Szatmári Angelika","Lampek Kinga","2021. április 6. (kedd) 15:30–17:15","kedd","2021. április 6. 15:30–17:15"]
["Egészségtudományok - Szekunder prevenció, családorvoslás, preventív medicina 3.",7,"Szabó Mónika","Szabó László","Balázs Margit","Szatmári Angelika","Boncz Imre","2021. április 7. (szerda) 08:00–09:45","szerda","2021. április 7. 08:00–09:45"]
["Egészségtudományok - Tercier prevenció, fizioterápia, rehabilitáció, ápolás és betegellátás 1.",7,"Rochlitz Ildikó","Horváth Mónika","Nagy Attila","Domján Andrea","Verzár Zsófia","2021. április 7. (szerda) 10:30–12:15","szerda","2021. április 7. 10:30–12:15"]
["Egészségtudományok - Tercier prevenció, fizioterápia, rehabilitáció, ápolás és betegellátás 2.",7,"Lukács Andrea","Horváth Mónika","Nagy Attila","Paulik Edit","Hock Márta","2021. április 8. (csütörtök) 08:00–09:45","csütörtök","2021. április 8. 08:00–09:45"]
{"$rows_left_out":64}
{"sheet":"Helyezesek_SZTE_AOK","index":6,"n_rows":45,"n_cols":6,"rows_kept":45,"cut":false,"hidden":false,"merged":[]}
["Díj","Tagozat","Szerző(k)","Cím","Témavezető(k)","Intézet(ek)"]
["I. díj","Operatív orvostudományok - Aneszteziológia és intenzív terápia, sürgősségi betegellátás 1.","Ballók Bence, Kulcsár Richárd Máté","Új modalitás fejlesztése a gépi lélegeztetésben: kevert frekvenciák alkalmazása állatkísérletes modellben","Dr. Fodor Gergely (egyetemi adjunktus), Dr. Peták Ferenc (egyetemi tanár)","Orvosi Fizikai és Orvosi Informatikai Intézet"]
["I. díj","Elméleti orvostudományok - Élettan, kórélettan 2.","Dr. Hantosi Dóra","A dimetil-triptamin neuroprotektív hatása iszkémiás patkány agykéregben","Prof. Bari Ferenc (egyetemi tanár), Szabó Írisz (tudományos segédmunkatárs)","Orvosi Fizikai és Orvosi Informatikai Intézet"]
["I. díj","Elméleti orvostudományok - Élettan, kórélettan 4.","Fejes Alexandra, Gausz Flóra Diána","A kinurénsav potenciális prekondícionáló hatásának vizsgálata doxorubicin indukálta akut szívkárosodás modellben","Dr. Csont Tamás (egyetemi docens), Dr. Demján Virág (PhD hallgató)","Biokémiai Intézet"]
["I. díj","Elméleti orvostudományok - Élettan, kórélettan 7.","Gausz Flóra Diána, Fejes Alexandra","Szívkárosodás vizsgálata hím és nőstény db/db egerekben","Dr. Csont Tamás (egyetemi docens), Dr. Szűcs Gergő (tudományos munkatárs)","Biokémiai Intézet"]
["I. díj","Operatív orvostudományok - Mellkasi- hasi- és plasztikai sebészet, transzplantációs sebészet","Jász Dávid Kurszán, Baráth Bálint","Metán dúsított transzplantációs oldat javítja a graft funkciót heterotróp szívtranszplantáció patkány modelljében","Dr. Hartmann Petra (egyetemi adjunktus)","Sebészeti Műtéttani Intézet"]
["I. díj","Egészségtudományok - Klinikai és elméleti epidemiológia 2.","Kovács Barbara Nóra","A cukorbetegek kardiovaszkuláris állapotromlásának szezonális ingadozása: a vérnyomás szerepének vizsgálata","Dr. Babik Barna (egyetemi tanár), Dr. Peták Ferenc (egyetemi tanár)","Aneszteziológiai és Intenzív Terápiás Intézet, Orvosi Fizikai és Orvosi Informatikai Intézet"]
["I. díj","Operatív orvostudományok - Kísérletes sebészet, kísérletes aneszteziológia","Kulcsár Richárd Máté, Ballók Bence","Humán használatú kapnográf adaptálása kisállat modellre 3D-nyomtatás felhasználásával","Dr. Fodor Gergely (egyetemi adjunktus), Dr. Peták Ferenc (egyetemi tanár)","Orvosi Fizikai és Orvosi Informatikai Intézet"]
["I. díj","Konzervatív orvostudományok - Patológia, hisztológia, igazságügyi orvostan 2.","Meszlényi Valéria Éva, Nógrádi Bernát","Különböző genetikai mutációkkal rendelkező amiotrófiás laterálszklerózis betegek vérszérumával történő passzív transzfer hatása egerek ideg-izom szinapszisaira","Dr. Patai Roland (tudományos munkatárs), Dr. Siklós László (tudományos tanácsadó)","SZBK, Biofizikai Intézet"]
["I. díj","Operatív orvostudományok - Aneszteziológia és intenzív terápia, sürgősségi betegellátás 2.","Szakáll Richárd","„Ápol és eltakar”?: Transzkután CO2 mérés pontosságának vizsgálata","Dr. Babik Barna (egyetemi tanár), Dr. Fodor Gergely (egyetemi adjunktus)","Aneszteziológiai és Intenzív Terápiás Intézet, Orvosi Fizikai és Orvosi Informatikai Intézet"]
["I. díj","Elméleti orvostudományok - Élettan, kórélettan 3.","Szarvas Péter Archibald","Különböző módszerekkel kiváltott terjedő depolarizációk elektrofiziológiai és szövettani jellemzése patkány agyszeleten","Dr. Menyhárt Ákos (egyetemi adjunktus), Frank Rita (PhD hallgató)","Orvosi Fizikai és Orvosi Informatikai Intézet"]
["I. díj","Egészségtudományok - Primer prevenció, védőnői prevenció, dietetika 4.","Szatmári Ferenc, Lázár Tímea","A méhnyakrákkal és a human papillomavírussal kapcsolatos ismeretek vizsgálata tudásindex használatával","Dr. Pócs Dávid (tudományos segédmunkatárs), Erdős Csaba (tudományos segédmunkatárs)","Népegészségtani Intézet, Magatartástudományi Intézet"]
["I. díj","Elméleti orvostudományok - Molekuláris biológia","Tóth Dávid","SARS-Cov-2 fehérjék és LC3 kölcsönhatásának analízise MCF-7 sejtekben","Dr. Horváth V. Gábor (tudományos főmunkatárs), Dr. Juhász Gábor (tudományos tanácsadó)","SZBK, Genetika Intézet"]
["I. díj","Konzervatív orvostudományok - Neurológia, neurovaszkuláris medicina, pszichiátria 2.","Weber Carmen Sahra, Emig Justine","Short term and long term reproducibility of Quantitative Sensory Testing (QST)","Dr. Kincses Bálint (PhD hallgató), Dr. Kincses Zsigmond Tamás (egyetemi docens)","Radiológiai Klinika"]
["II. díj","Konzervatív orvostudományok - Patológia, hisztológia, igazságügyi orvostan 1.","Fekete Zoltán, Bordács Barbara","Syntaxin-1A kifejeződése tápcsatornai neuroendokrin tumorokban és carcinomákban","Dr. Kővári Bence (egyetemi adjunktus)","Pathológiai Intézet"]
{"$rows_left_out":30}