{"text_format":"2","workbook":"xlsx","n_sheets":4,"sheets":["palyazati urlap","adatok","formai szakmai ertekeles","ISCED-F kodok"],"not_rendered":{"charts":0,"images":2,"macros":0,"external_links":1,"defined_names":12,"comments":1,"pivot_tables":0},"unopened":[],"bounds":{"document_bytes":16777216,"sheet_cells":100000,"run_cost":"one","rows_first":2000,"rows_last":500,"rows_between":2000,"halvings":0,"cell_chars":16384,"cell_head_chars":4096},"cells_cut":0,"cells_raw":0,"read":"whole","date_system":"1900"}

{"sheet":"palyazati urlap","index":0,"n_rows":152,"n_cols":16377,"rows_kept":152,"cut":false,"hidden":false,"merged":[[0,0,0,10],[2,0,2,11],[3,0,3,11],[109,0,109,3],[109,4,109,7],[109,8,109,9],[109,10,109,11],[148,1,148,10],[150,8,150,11],[147,1,147,6],[103,0,103,3],[103,4,103,7],[103,8,103,9],[103,10,103,11],[105,0,105,3],[105,4,105,7],[105,8,105,9],[105,10,105,11],[107,0,107,3],[107,4,107,7],[107,8,107,9],[107,10,107,11],[97,0,97,3],[97,8,97,9],[81,10,81,11],[83,0,83,3],[83,4,83,7],[83,8,83,9],[83,10,83,11],[79,4,79,7],[79,10,79,11],[80,8,80,9],[82,8,82,9],[99,0,99,3],[99,4,99,7],[99,8,99,9],[99,10,99,11],[101,0,101,3],[101,4,101,7],[101,8,101,9],[101,10,101,11],[87,4,87,7],[87,8,87,9],[87,10,87,11],[89,0,89,3],[89,4,89,7],[89,8,89,9],[89,10,89,11],[91,0,91,3],[91,4,91,7],[91,8,91,9],[91,10,91,11],[63,10,63,11],[25,0,25,3],[27,8,27,9],[27,10,27,11],[120,12,120,15],[21,0,21,3],[23,0,23,3],[49,5,49,6],[53,0,53,4],[53,5,53,11],[45,0,45,3],[45,8,45,9],[45,10,45,11],[47,0,47,3],[47,8,47,9],[47,10,47,11],[45,5,45,6],[51,0,51,3],[35,1,35,3],[31,4,31,7],[31,10,31,11],[85,0,85,3],[85,4,85,7],[85,8,85,9],[85,10,85,11],[87,0,87,3],[29,0,29,3],[79,0,79,3],[79,8,79,9],[81,0,81,3],[81,4,81,7],[81,8,81,9],[21,10,21,11],[9,4,9,11],[11,4,11,11],[15,4,15,11],[27,4,27,7],[150,3,150,4],[151,8,151,10],[136,1,136,6],[138,1,139,10],[143,3,143,4],[143,5,143,6],[115,1,115,10],[141,1,141,2],[141,3,141,7],[143,8,143,11],[144,8,144,11],[128,1,128,10],[126,1,126,10],[124,1,124,10],[122,1,122,10],[120,1,120,10],[71,8,71,9],[29,4,29,7],[29,8,29,9],[29,10,29,11],[27,0,27,3],[25,4,25,11],[67,10,67,11],[61,0,61,3],[63,0,63,3],[63,4,63,7],[63,8,63,9],[17,4,17,11],[13,8,13,9],[13,10,13,11],[5,1,5,3],[5,4,5,8],[9,0,9,3],[11,0,11,3],[13,0,13,3],[13,4,13,7],[15,0,15,3],[17,0,17,3],[71,10,71,11],[73,0,73,3],[73,4,73,7],[73,8,73,9],[73,10,73,11],[33,0,33,3],[33,4,33,7],[69,10,69,11],[65,0,65,3],[65,4,65,7],[65,8,65,9],[65,10,65,11],[67,0,67,3],[67,4,67,7],[67,8,67,9],[39,2,39,4],[39,5,39,7],[41,2,41,4],[41,5,41,7],[61,4,61,7],[61,10,61,11],[55,12,55,15],[55,16,55,19],[55,20,55,23],[55,24,55,27],[55,28,55,31],[55,32,55,35],[55,36,55,39],[55,40,55,43],[55,44,55,47],[19,4,19,11],[23,4,23,11],[21,8,21,9],[33,10,33,11],[133,0,133,3],[133,4,133,7],[133,8,133,9],[130,1,130,10],[47,5,47,6],[61,8,61,9],[31,0,31,3],[31,8,31,9],[33,8,33,9],[49,0,49,3],[49,8,49,9],[49,10,49,11],[69,0,69,3],[69,4,69,7],[69,8,69,9],[71,0,71,3],[71,4,71,7],[19,0,19,3],[21,4,21,7],[55,84,55,87],[55,88,55,91],[55,92,55,95],[55,96,55,99],[55,100,55,103],[55,104,55,107],[55,108,55,111],[55,112,55,115],[55,116,55,119],[55,48,55,51],[55,52,55,55],[55,56,55,59],[55,60,55,63],[55,64,55,67],[55,68,55,71],[55,72,55,75],[55,76,55,79],[55,80,55,83],[55,156,55,159],[55,160,55,163],[55,164,55,167],[55,168,55,171],[55,172,55,175],[55,176,55,179],[55,180,55,183],[55,184,55,187],[55,188,55,191],[55,120,55,123],[55,124,55,127],[55,128,55,131],[55,132,55,135],[55,136,55,139],[55,140,55,143],[55,144,55,147],[55,148,55,151],[55,152,55,155],[55,228,55,231],[55,232,55,235],[55,236,55,239],[55,240,55,243],[55,244,55,247],[55,248,55,251],[55,252,55,255],[55,256,55,259],[55,260,55,263],[55,192,55,195],[55,196,55,199],[55,200,55,203],[55,204,55,207],[55,208,55,211],[55,212,55,215],[55,216,55,219],[55,220,55,223],[55,224,55,227],[55,300,55,303],[55,304,55,307],[55,308,55,311],[55,312,55,315],[55,316,55,319],[55,320,55,323],[55,324,55,327],[55,328,55,331],[55,332,55,335],[55,264,55,267],[55,268,55,271],[55,272,55,275],[55,276,55,279],[55,280,55,283],[55,284,55,287],[55,288,55,291],[55,292,55,295],[55,296,55,299],[55,372,55,375],[55,376,55,379],[55,380,55,383],[55,384,55,387],[55,388,55,391],[55,392,55,395],[55,396,55,399],[55,400,55,403],[55,404,55,407],[55,336,55,339],[55,340,55,343],[55,344,55,347],[55,348,55,351],[55,352,55,355],[55,356,55,359],[55,360,55,363],[55,364,55,367],[55,368,55,371],[55,444,55,447],[55,448,55,451],[55,452,55,455],[55,456,55,459],[55,460,55,463],[55,464,55,467],[55,468,55,471],[55,472,55,475],[55,476,55,479],[55,408,55,411],[55,412,55,415],[55,416,55,419],[55,420,55,423],[55,424,55,427],[55,428,55,431],[55,432,55,435],[55,436,55,439],[55,440,55,443],[55,516,55,519],[55,520,55,523],[55,524,55,527],[55,528,55,531],[55,532,55,535],[55,536,55,539],[55,540,55,543],[55,544,55,547],[55,548,55,551],[55,480,55,483],[55,484,55,487],[55,488,55,491],[55,492,55,495],[55,496,55,499],[55,500,55,503],[55,504,55,507],[55,508,55,511],[55,512,55,515],[55,588,55,591],[55,592,55,595],[55,596,55,599],[55,600,55,603],[55,604,55,607],[55,608,55,611],[55,612,55,615],[55,616,55,619],[55,620,55,623],[55,552,55,555],[55,556,55,559],[55,560,55,563],[55,564,55,567],[55,568,55,571],[55,572,55,575],[55,576,55,579],[55,580,55,583],[55,584,55,587],[55,660,55,663],[55,664,55,667],[55,668,55,671],[55,672,55,675],[55,676,55,679],[55,680,55,683],[55,684,55,687],[55,688,55,691],[55,692,55,695],[55,624,55,627],[55,628,55,631],[55,632,55,635],[55,636,55,639],[55,640,55,643],[55,644,55,647],[55,648,55,651],[55,652,55,655],[55,656,55,659],[55,732,55,735],[55,736,55,739],[55,740,55,743],[55,744,55,747],[55,748,55,751],[55,752,55,755],[55,756,55,759],[55,760,55,763],[55,764,55,767],[55,696,55,699],[55,700,55,703],[55,704,55,707],[55,708,55,711],[55,712,55,715],[55,716,55,719],[55,720,55,723],[55,724,55,727],[55,728,55,731],[55,804,55,807],[55,808,55,811],[55,812,55,815],[55,816,55,819],[55,820,55,823],[55,824,55,827],[55,828,55,831],[55,832,55,835],[55,836,55,839],[55,768,55,771],[55,772,55,775],[55,776,55,779],[55,780,55,783],[55,784,55,787],[55,788,55,791],[55,792,55,795],[55,796,55,799],[55,800,55,803],[55,876,55,879],[55,880,55,883],[55,884,55,887],[55,888,55,891],[55,892,55,895],[55,896,55,899],[55,900,55,903],[55,904,55,907],[55,908,55,911],[55,840,55,843],[55,844,55,847],[55,848,55,851],[55,852,55,855],[55,856,55,859],[55,860,55,863],[55,864,55,867],[55,868,55,871],[55,872,55,875],[55,948,55,951],[55,952,55,955],[55,956,55,959],[55,960,55,963],[55,964,55,967],[55,968,55,971],[55,972,55,975],[55,976,55,979],[55,980,55,983],[55,912,55,915],[55,916,55,919],[55,920,55,923],[55,924,55,927],[55,928,55,931],[55,932,55,935],[55,936,55,939],[55,940,55,943],[55,944,55,947],[55,1020,55,1023],[55,1024,55,1027],[55,1028,55,1031],[55,1032,55,1035],[55,1036,55,1039],[55,1040,55,1043],[55,1044,55,1047],[55,1048,55,1051],[55,1052,55,1055],[55,984,55,987],[55,988,55,991],[55,992,55,995],[55,996,55,999],[55,1000,55,1003],[55,1004,55,1007],[55,1008,55,1011],[55,1012,55,1015],[55,1016,55,1019],[55,1092,55,1095],[55,1096,55,1099],[55,1100,55,1103],[55,1104,55,1107],[55,1108,55,1111],[55,1112,55,1115],[55,1116,55,1119],[55,1120,55,1123],[55,1124,55,1127],[55,1056,55,1059],[55,1060,55,1063],[55,1064,55,1067],[55,1068,55,1071],[55,1072,55,1075],[55,1076,55,1079],[55,1080,55,1083],[55,1084,55,1087],[55,1088,55,1091],[55,1164,55,1167],[55,1168,55,1171],[55,1172,55,1175],[55,1176,55,1179],[55,1180,55,1183],[55,1184,55,1187],[55,1188,55,1191],[55,1192,55,1195],[55,1196,55,1199],[55,1128,55,1131],[55,1132,55,1135],[55,1136,55,1139],[55,1140,55,1143],[55,1144,55,1147],[55,1148,55,1151],[55,1152,55,1155],[55,1156,55,1159],[55,1160,55,1163],[55,1236,55,1239],[55,1240,55,1243],[55,1244,55,1247],[55,1248,55,1251],[55,1252,55,1255],[55,1256,55,1259],[55,1260,55,1263],[55,1264,55,1267],[55,1268,55,1271],[55,1200,55,1203],[55,1204,55,1207],[55,1208,55,1211],[55,1212,55,1215],[55,1216,55,1219],[55,1220,55,1223],[55,1224,55,1227],[55,1228,55,1231],[55,1232,55,1235],[55,1308,55,1311],[55,1312,55,1315],[55,1316,55,1319],[55,1320,55,1323],[55,1324,55,1327],[55,1328,55,1331],[55,1332,55,1335],[55,1336,55,1339],[55,1340,55,1343],[55,1272,55,1275],[55,1276,55,1279],[55,1280,55,1283],[55,1284,55,1287],[55,1288,55,1291],[55,1292,55,1295],[55,1296,55,1299],[55,1300,55,1303],[55,1304,55,1307],[55,1380,55,1383],[55,1384,55,1387],[55,1388,55,1391],[55,1392,55,1395],[55,1396,55,1399],[55,1400,55,1403],[55,1404,55,1407],[55,1408,55,1411],[55,1412,55,1415],[55,1344,55,1347],[55,1348,55,1351],[55,1352,55,1355],[55,1356,55,1359],[55,1360,55,1363],[55,1364,55,1367],[55,1368,55,1371],[55,1372,55,1375],[55,1376,55,1379],[55,1452,55,1455],[55,1456,55,1459],[55,1460,55,1463],[55,1464,55,1467],[55,1468,55,1471],[55,1472,55,1475],[55,1476,55,1479],[55,1480,55,1483],[55,1484,55,1487],[55,1416,55,1419],[55,1420,55,1423],[55,1424,55,1427],[55,1428,55,1431],[55,1432,55,1435],[55,1436,55,1439],[55,1440,55,1443],[55,1444,55,1447],[55,1448,55,1451],[55,1524,55,1527],[55,1528,55,1531],[55,1532,55,1535],[55,1536,55,1539],[55,1540,55,1543],[55,1544,55,1547],[55,1548,55,1551],[55,1552,55,1555],[55,1556,55,1559],[55,1488,55,1491],[55,1492,55,1495],[55,1496,55,1499],[55,1500,55,1503],[55,1504,55,1507],[55,1508,55,1511],[55,1512,55,1515],[55,1516,55,1519],[55,1520,55,1523],[55,1596,55,1599],[55,1600,55,1603],[55,1604,55,1607],[55,1608,55,1611],[55,1612,55,1615],[55,1616,55,1619],[55,1620,55,1623],[55,1624,55,1627],[55,1628,55,1631],[55,1560,55,1563],[55,1564,55,1567],[55,1568,55,1571],[55,1572,55,1575],[55,1576,55,1579],[55,1580,55,1583],[55,1584,55,1587],[55,1588,55,1591],[55,1592,55,1595],[55,1668,55,1671],[55,1672,55,1675],[55,1676,55,1679],[55,1680,55,1683],[55,1684,55,1687],[55,1688,55,1691],[55,1692,55,1695],[55,1696,55,1699],[55,1700,55,1703],[55,1632,55,1635],[55,1636,55,1639],[55,1640,55,1643],[55,1644,55,1647],[55,1648,55,1651],[55,1652,55,1655],[55,1656,55,1659],[55,1660,55,1663],[55,1664,55,1667],[55,1740,55,1743],[55,1744,55,1747],[55,1748,55,1751],[55,1752,55,1755],[55,1756,55,1759],[55,1760,55,1763],[55,1764,55,1767],[55,1768,55,1771],[55,1772,55,1775],[55,1704,55,1707],[55,1708,55,1711],[55,1712,55,1715],[55,1716,55,1719],[55,1720,55,1723],[55,1724,55,1727],[55,1728,55,1731],[55,1732,55,1735],[55,1736,55,1739],[55,1812,55,1815],[55,1816,55,1819],[55,1820,55,1823],[55,1824,55,1827],[55,1828,55,1831],[55,1832,55,1835],[55,1836,55,1839],[55,1840,55,1843],[55,1844,55,1847],[55,1776,55,1779],[55,1780,55,1783],[55,1784,55,1787],[55,1788,55,1791],[55,1792,55,1795],[55,1796,55,1799],[55,1800,55,1803],[55,1804,55,1807],[55,1808,55,1811],[55,1884,55,1887],[55,1888,55,1891],[55,1892,55,1895],[55,1896,55,1899],[55,1900,55,1903],[55,1904,55,1907],[55,1908,55,1911],[55,1912,55,1915],[55,1916,55,1919],[55,1848,55,1851],[55,1852,55,1855],[55,1856,55,1859],[55,1860,55,1863],[55,1864,55,1867],[55,1868,55,1871],[55,1872,55,1875],[55,1876,55,1879],[55,1880,55,1883],[55,1956,55,1959],[55,1960,55,1963],[55,1964,55,1967],[55,1968,55,1971],[55,1972,55,1975],[55,1976,55,1979],[55,1980,55,1983],[55,1984,55,1987],[55,1988,55,1991],[55,1920,55,1923],[55,1924,55,1927],[55,1928,55,1931],[55,1932,55,1935],[55,1936,55,1939],[55,1940,55,1943],[55,1944,55,1947],[55,1948,55,1951],[55,1952,55,1955],[55,2028,55,2031],[55,2032,55,2035],[55,2036,55,2039],[55,2040,55,2043],[55,2044,55,2047],[55,2048,55,2051],[55,2052,55,2055],[55,2056,55,2059],[55,2060,55,2063],[55,1992,55,1995],[55,1996,55,1999],[55,2000,55,2003],[55,2004,55,2007],[55,2008,55,2011],[55,2012,55,2015],[55,2016,55,2019],[55,2020,55,2023],[55,2024,55,2027],[55,2100,55,2103],[55,2104,55,2107],[55,2108,55,2111],[55,2112,55,2115],[55,2116,55,2119],[55,2120,55,2123],[55,2124,55,2127],[55,2128,55,2131],[55,2132,55,2135],[55,2064,55,2067],[55,2068,55,2071],[55,2072,55,2075],[55,2076,55,2079],[55,2080,55,2083],[55,2084,55,2087],[55,2088,55,2091],[55,2092,55,2095],[55,2096,55,2099],[55,2172,55,2175],[55,2176,55,2179],[55,2180,55,2183],[55,2184,55,2187],[55,2188,55,2191],[55,2192,55,2195],[55,2196,55,2199],[55,2200,55,2203],[55,2204,55,2207],[55,2136,55,2139],[55,2140,55,2143],[55,2144,55,2147],[55,2148,55,2151],[55,2152,55,2155],[55,2156,55,2159],[55,2160,55,2163],[55,2164,55,2167],[55,2168,55,2171],[55,2244,55,2247],[55,2248,55,2251],[55,2252,55,2255],[55,2256,55,2259],[55,2260,55,2263],[55,2264,55,2267],[55,2268,55,2271],[55,2272,55,2275],[55,2276,55,2279],[55,2208,55,2211],[55,2212,55,2215],[55,2216,55,2219],[55,2220,55,2223],[55,2224,55,2227],[55,2228,55,2231],[55,2232,55,2235],[55,2236,55,2239],[55,2240,55,2243],[55,2316,55,2319],[55,2320,55,2323],[55,2324,55,2327],[55,2328,55,2331],[55,2332,55,2335],[55,2336,55,2339],[55,2340,55,2343],[55,2344,55,2347],[55,2348,55,2351],[55,2280,55,2283],[55,2284,55,2287],[55,2288,55,2291],[55,2292,55,2295],[55,2296,55,2299],[55,2300,55,2303],[55,2304,55,2307],[55,2308,55,2311],[55,2312,55,2315],[55,2388,55,2391],[55,2392,55,2395],[55,2396,55,2399],[55,2400,55,2403],[55,2404,55,2407],[55,2408,55,2411],[55,2412,55,2415],[55,2416,55,2419],[55,2420,55,2423],[55,2352,55,2355],[55,2356,55,2359],[55,2360,55,2363],[55,2364,55,2367],[55,2368,55,2371],[55,2372,55,2375],[55,2376,55,2379],[55,2380,55,2383],[55,2384,55,2387],[55,2460,55,2463],[55,2464,55,2467],[55,2468,55,2471],[55,2472,55,2475],[55,2476,55,2479],[55,2480,55,2483],[55,2484,55,2487],[55,2488,55,2491],[55,2492,55,2495],[55,2424,55,2427],[55,2428,55,2431],[55,2432,55,2435],[55,2436,55,2439],[55,2440,55,2443],[55,2444,55,2447],[55,2448,55,2451],[55,2452,55,2455],[55,2456,55,2459],[55,2532,55,2535],[55,2536,55,2539],[55,2540,55,2543],[55,2544,55,2547],[55,2548,55,2551],[55,2552,55,2555],[55,2556,55,2559],[55,2560,55,2563],[55,2564,55,2567],[55,2496,55,2499],[55,2500,55,2503],[55,2504,55,2507],[55,2508,55,2511],[55,2512,55,2515],[55,2516,55,2519],[55,2520,55,2523],[55,2524,55,2527],[55,2528,55,2531],[55,2604,55,2607],[55,2608,55,2611],[55,2612,55,2615],[55,2616,55,2619],[55,2620,55,2623],[55,2624,55,2627],[55,2628,55,2631],[55,2632,55,2635],[55,2636,55,2639],[55,2568,55,2571],[55,2572,55,2575],[55,2576,55,2579],[55,2580,55,2583],[55,2584,55,2587],[55,2588,55,2591],[55,2592,55,2595],[55,2596,55,2599],[55,2600,55,2603],[55,2676,55,2679],[55,2680,55,2683],[55,2684,55,2687],[55,2688,55,2691],[55,2692,55,2695],[55,2696,55,2699],[55,2700,55,2703],[55,2704,55,2707],[55,2708,55,2711],[55,2640,55,2643],[55,2644,55,2647],[55,2648,55,2651],[55,2652,55,2655],[55,2656,55,2659],[55,2660,55,2663],[55,2664,55,2667],[55,2668,55,2671],[55,2672,55,2675],[55,2748,55,2751],[55,2752,55,2755],[55,2756,55,2759],[55,2760,55,2763],[55,2764,55,2767],[55,2768,55,2771],[55,2772,55,2775],[55,2776,55,2779],[55,2780,55,2783],[55,2712,55,2715],[55,2716,55,2719],[55,2720,55,2723],[55,2724,55,2727],[55,2728,55,2731],[55,2732,55,2735],[55,2736,55,2739],[55,2740,55,2743],[55,2744,55,2747],[55,2820,55,2823],[55,2824,55,2827],[55,2828,55,2831],[55,2832,55,2835],[55,2836,55,2839],[55,2840,55,2843],[55,2844,55,2847],[55,2848,55,2851],[55,2852,55,2855],[55,2784,55,2787],[55,2788,55,2791],[55,2792,55,2795],[55,2796,55,2799],[55,2800,55,2803],[55,2804,55,2807],[55,2808,55,2811],[55,2812,55,2815],[55,2816,55,2819],[55,2892,55,2895],[55,2896,55,2899],[55,2900,55,2903],[55,2904,55,2907],[55,2908,55,2911],[55,2912,55,2915],[55,2916,55,2919],[55,2920,55,2923],[55,2924,55,2927],[55,2856,55,2859],[55,2860,55,2863],[55,2864,55,2867],[55,2868,55,2871],[55,2872,55,2875],[55,2876,55,2879],[55,2880,55,2883],[55,2884,55,2887],[55,2888,55,2891],[55,2964,55,2967],[55,2968,55,2971],[55,2972,55,2975],[55,2976,55,2979],[55,2980,55,2983],[55,2984,55,2987],[55,2988,55,2991],[55,2992,55,2995],[55,2996,55,2999],[55,2928,55,2931],[55,2932,55,2935],[55,2936,55,2939],[55,2940,55,2943],[55,2944,55,2947],[55,2948,55,2951],[55,2952,55,2955],[55,2956,55,2959],[55,2960,55,2963],[55,3036,55,3039],[55,3040,55,3043],[55,3044,55,3047],[55,3048,55,3051],[55,3052,55,3055],[55,3056,55,3059],[55,3060,55,3063],[55,3064,55,3067],[55,3068,55,3071],[55,3000,55,3003],[55,3004,55,3007],[55,3008,55,3011],[55,3012,55,3015],[55,3016,55,3019],[55,3020,55,3023],[55,3024,55,3027],[55,3028,55,3031],[55,3032,55,3035],[55,3108,55,3111],[55,3112,55,3115],[55,3116,55,3119],[55,3120,55,3123],[55,3124,55,3127],[55,3128,55,3131],[55,3132,55,3135],[55,3136,55,3139],[55,3140,55,3143],[55,3072,55,3075],[55,3076,55,3079],[55,3080,55,3083],[55,3084,55,3087],[55,3088,55,3091],[55,3092,55,3095],[55,3096,55,3099],[55,3100,55,3103],[55,3104,55,3107],[55,3180,55,3183],[55,3184,55,3187],[55,3188,55,3191],[55,3192,55,3195],[55,3196,55,3199],[55,3200,55,3203],[55,3204,55,3207],[55,3208,55,3211],[55,3212,55,3215],[55,3144,55,3147],[55,3148,55,3151],[55,3152,55,3155],[55,3156,55,3159],[55,3160,55,3163],[55,3164,55,3167],[55,3168,55,3171],[55,3172,55,3175],[55,3176,55,3179],[55,3252,55,3255],[55,3256,55,3259],[55,3260,55,3263],[55,3264,55,3267],[55,3268,55,3271],[55,3272,55,3275],[55,3276,55,3279],[55,3280,55,3283],[55,3284,55,3287],[55,3216,55,3219],[55,3220,55,3223],[55,3224,55,3227],[55,3228,55,3231],[55,3232,55,3235],[55,3236,55,3239],[55,3240,55,3243],[55,3244,55,3247],[55,3248,55,3251],[55,3324,55,3327],[55,3328,55,3331],[55,3332,55,3335],[55,3336,55,3339],[55,3340,55,3343],[55,3344,55,3347],[55,3348,55,3351],[55,3352,55,3355],[55,3356,55,3359],[55,3288,55,3291]],"merged_total":4278,"flags":["merged_cut"]}
["Nemzeti Kiválóság Program - Campus Hungary"]
[]
["Felsőoktatási hallgatói mobilitás"]
["pályázati űrlap 2014/2015"]
[]
[null,"Mobilitás típusa:"]
[]
[null,null,null,"Hallgató adatai:"]
[]
["Neve:"]
[]
["Hallgató születési neve:"]
[]
["Születési hely:",{"$nulls":7},"Születési idő:"]
[]
["Anyja születési neve:"]
[]
["Lakóhely (állandó lakcím):"]
[]
["Értesítési cím: "]
[]
["E-mail cím:",{"$nulls":7},"Mobiltelefon:"]
[]
["Felsőoktatási intézmény neve:"]
[]
["Kar:"]
[]
["Intézet, tanszék: ",{"$nulls":7},"Város:"]
[]
["Képzési szint: ",{"$nulls":7},"Évfolyam(ok):"]
[]
["Szak(ok):",{"$nulls":7},"Szakterület kódja:"]
[]
["Hallgató OM azonosítója:",{"$nulls":7},"Neptun/ETR kód:"]
[]
[null,"Pályázati információk:"]
[]
[null,null,"A hallgató súlyozott tanulmányi átlagai"]
[]
[null,null,"Utolsó előtti lezárt félév átlaga:"]
[]
[null,null,"Utolsó lezárt félév átlaga:"]
[]
[null,null,"Nyelvtudás"]
[]
["1. nyelv",{"$nulls":4},"Szint:",null,null,"Igazolás száma:"]
[]
["2. nyelv",{"$nulls":4},"Szint:",null,null,"Igazolás száma:"]
[]
["3. nyelv",{"$nulls":4},"Szint:",null,null,"Igazolás száma:"]
[]
["OTDK / TDK helyezés:"]
[]
["Más tudományos/kutatási tevékenység:"]
[]
[null,"A tervezett mobilitást megelőző, a jelenlegi képzési ciklusban végzett vagy végzendő LLP/ERASMUS és ERASMUS+ hónapok száma.",{"$nulls":14},"OTDK / TDK helyezés:",{"$nulls":7},"OTDK / TDK helyezés:",{"$nulls":7},"OTDK / TDK helyezés:",{"$nulls":7},"OTDK / TDK helyezés:",{"$nulls":7},"OTDK / TDK helyezés:",{"$nulls":7},"OTDK / TDK helyezés:",{"$nulls":7},"OTDK / TDK helyezés:",{"$nulls":7},"OTDK / TDK helyezés:",{"$nulls":7},"OTDK / TDK helyezés:",{"$nulls":7},"OTDK / TDK helyezés:",{"$nulls":7},"OTDK / TDK helyezés:",{"$nulls":7},"OTDK / TDK helyezés:",{"$nulls":7},"OTDK / TDK helyezés:",{"$nulls":7},"OTDK / TDK helyezés:",{"$nulls":7},"OTDK / TDK helyezés:",{"$nulls":7},"OTDK / TDK helyezés:",{"$nulls":7},"OTDK / TDK helyezés:",{"$nulls":7},"OTDK / TDK helyezés:",{"$nulls":7},"OTDK / TDK helyezés:",{"$nulls":7},"OTDK / TDK helyezés:",{"$nulls":7},"OTDK / TDK helyezés:",{"$nulls":7},"OTDK / TDK helyezés:",{"$nulls":7},"OTDK / TDK helyezés:",{"$nulls":7},"OTDK / TDK helyezés:",{"$nulls":7},"OTDK / TDK helyezés:",{"$nulls":7},"OTDK / TDK helyezés:",{"$nulls":7},"OTDK / TDK helyezés:",{"$nulls":7},"OTDK / TDK helyezés:",{"$nulls":7},"OTDK / TDK helyezés:",{"$nulls":7},"OTDK / TDK helyezés:",{"$nulls":7},"OTDK / TDK helyezés:",{"$nulls":7},"OTDK / TDK helyezés:",{"$nulls":7},"OTDK / TDK helyezés:",{"$nulls":7},"OTDK / TDK helyezés:",{"$nulls":7},"OTDK / TDK helyezés:",{"$nulls":7},"OTDK / TDK helyezés:",{"$nulls":7},"OTDK / TDK helyezés:",{"$nulls":7},"OTDK / TDK helyezés:",{"$nulls":7},"OTDK / TDK helyezés:",{"$nulls":7},"OTDK / TDK helyezés:",{"$nulls":7},"OTDK / TDK helyezés:",{"$nulls":7},"OTDK / TDK helyezés:",{"$nulls":7},"OTDK / TDK helyezés:",{"$nulls":7},"OTDK / TDK helyezés:",{"$nulls":7},"OTDK / TDK helyezés:",{"$nulls":7},"OTDK / TDK helyezés:",{"$nulls":7},"OTDK / TDK helyezés:",{"$nulls":7},"OTDK / TDK helyezés:",{"$nulls":7},"OTDK / TDK helyezés:",{"$nulls":7},"OTDK / TDK helyezés:",{"$nulls":7},"OTDK / TDK helyezés:",{"$nulls":7},"OTDK / TDK helyezés:",{"$nulls":7},"OTDK / TDK helyezés:",{"$nulls":7},"OTDK / TDK helyezés:",{"$nulls":7},"OTDK / TDK helyezés:",{"$nulls":7},"OTDK / TDK helyezés:",{"$nulls":7},"OTDK / TDK helyezés:",{"$nulls":7},"OTDK / TDK helyezés:",{"$nulls":7},"OTDK / TDK helyezés:",{"$nulls":7},"OTDK / TDK helyezés:",{"$nulls":7},"OTDK / TDK helyezés:",{"$nulls":7},"OTDK / TDK helyezés:",{"$nulls":7},"OTDK / TDK helyezés:",{"$nulls":7},"OTDK / TDK helyezés:",{"$nulls":7},"OTDK / TDK helyezés:",{"$nulls":7},"OTDK / TDK helyezés:",{"$nulls":7},"OTDK / TDK helyezés:",{"$nulls":7},"OTDK / TDK helyezés:",{"$nulls":7},"OTDK / TDK helyezés:",{"$nulls":7},"OTDK / TDK helyezés:",{"$nulls":7},"OTDK / TDK helyezés:",{"$nulls":7},"OTDK / TDK helyezés:",{"$nulls":7},"OTDK / TDK helyezés:",{"$nulls":7},"OTDK / TDK helyezés:",{"$nulls":7},"OTDK / TDK helyezés:",{"$nulls":7},"OTDK / TDK helyezés:",{"$nulls":7},"OTDK / TDK helyezés:",{"$nulls":7},"OTDK / TDK helyezés:",{"$nulls":7},"OTDK / TDK helyezés:",{"$nulls":7},"OTDK / TDK helyezés:",{"$nulls":7},"OTDK / TDK helyezés:",{"$nulls":7},"OTDK / TDK helyezés:",{"$nulls":7},"OTDK / TDK helyezés:",{"$nulls":7},"OTDK / TDK helyezés:",{"$nulls":7},"OTDK / TDK helyezés:",{"$nulls":7},"OTDK / TDK helyezés:",{"$nulls":7},"OTDK / TDK helyezés:",{"$nulls":7},"OTDK / TDK helyezés:",{"$nulls":7},"OTDK / TDK helyezés:",{"$nulls":7},"OTDK / TDK helyezés:",{"$nulls":7},"OTDK / TDK helyezés:",{"$nulls":7},"OTDK / TDK helyezés:",{"$nulls":7},"OTDK / TDK helyezés:",{"$nulls":7},"OTDK / TDK helyezés:",{"$nulls":7},"OTDK / TDK helyezés:",{"$nulls":7},"OTDK / TDK helyezés:",{"$nulls":7},"OTDK / TDK helyezés:",{"$nulls":7},"OTDK / TDK helyezés:",{"$nulls":7},"OTDK / TDK helyezés:",{"$nulls":7},"OTDK / TDK helyezés:",{"$nulls":7},"OTDK / TDK helyezés:",{"$nulls":7},"OTDK / TDK helyezés:",{"$nulls":7},"OTDK / TDK helyezés:",{"$nulls":7},"OTDK / TDK helyezés:",{"$nulls":7},"OTDK / TDK helyezés:",{"$nulls":7},"OTDK / TDK helyezés:",{"$nulls":7},"OTDK / TDK helyezés:",{"$nulls":7},"OTDK / TDK helyezés:",{"$nulls":7},"OTDK / TDK helyezés:",{"$nulls":7},"OTDK / TDK helyezés:",{"$nulls":7},"OTDK / TDK helyezés:",{"$nulls":7},"OTDK / TDK helyezés:",{"$nulls":7},"OTDK / TDK helyezés:",{"$nulls":7},"OTDK / TDK helyezés:",{"$nulls":7},"OTDK / TDK helyezés:",{"$nulls":7},"OTDK / TDK helyezés:",{"$nulls":7},"OTDK / TDK helyezés:",{"$nulls":7},"OTDK / TDK helyezés:",{"$nulls":7},"OTDK / TDK helyezés:",{"$nulls":7},"OTDK / TDK helyezés:",{"$nulls":7},"OTDK / TDK helyezés:",{"$nulls":7},"OTDK / TDK helyezés:",{"$nulls":7},"OTDK / TDK helyezés:",{"$nulls":7},"OTDK / TDK helyezés:",{"$nulls":7},"OTDK / TDK helyezés:",{"$nulls":7},"OTDK / TDK helyezés:",{"$nulls":7},"OTDK / TDK helyezés:",{"$nulls":7},"OTDK / TDK helyezés:",{"$nulls":7},"OTDK / TDK helyezés:",{"$nulls":7},"OTDK / TDK helyezés:",{"$nulls":7},"OTDK / TDK helyezés:",{"$nulls":7},"OTDK / TDK helyezés:",{"$nulls":7},"OTDK / TDK helyezés:",{"$nulls":7},"OTDK / TDK helyezés:",{"$nulls":7},"OTDK / TDK helyezés:",{"$nulls":7},"OTDK / TDK helyezés:",{"$nulls":7},"OTDK / TDK helyezés:",{"$nulls":7},"OTDK / TDK helyezés:",{"$nulls":7},"OTDK / TDK helyezés:",{"$nulls":7},"OTDK / TDK helyezés:",{"$nulls":7},"OTDK / TDK helyezés:",{"$nulls":7},"OTDK / TDK helyezés:",{"$nulls":7},"OTDK / TDK helyezés:",{"$nulls":7},"OTDK / TDK helyezés:",{"$nulls":7},"OTDK / TDK helyezés:",{"$nulls":7},"OTDK / TDK helyezés:",{"$nulls":7},"OTDK / TDK helyezés:",{"$nulls":7},"OTDK / TDK helyezés:",{"$nulls":7},"OTDK / TDK helyezés:",{"$nulls":7},"OTDK / TDK helyezés:",{"$nulls":7},"OTDK / TDK helyezés:",{"$nulls":7},"OTDK / TDK helyezés:",{"$nulls":7},"OTDK / TDK helyezés:",{"$nulls":7},"OTDK / TDK helyezés:",{"$nulls":7},"OTDK / TDK helyezés:",{"$nulls":7},"OTDK / TDK helyezés:",{"$nulls":7},"OTDK / TDK helyezés:",{"$nulls":7},"OTDK / TDK helyezés:",{"$nulls":7},"OTDK / TDK helyezés:",{"$nulls":7},"OTDK / TDK helyezés:",{"$nulls":7},"OTDK / TDK helyezés:",{"$nulls":7},"OTDK / TDK helyezés:",{"$nulls":7},"OTDK / TDK helyezés:",{"$nulls":7},"OTDK / TDK helyezés:",{"$nulls":7},"OTDK / TDK helyezés:",{"$nulls":7},"OTDK / TDK helyezés:",{"$nulls":7},"OTDK / TDK helyezés:",{"$nulls":7},"OTDK / TDK helyezés:",{"$nulls":7},"OTDK / TDK helyezés:",{"$nulls":7},"OTDK / TDK helyezés:",{"$nulls":7},"OTDK / TDK helyezés:",{"$nulls":7},"OTDK / TDK helyezés:",{"$nulls":7},"OTDK / TDK helyezés:",{"$nulls":7},"OTDK / TDK helyezés:",{"$nulls":7},"OTDK / TDK helyezés:",{"$nulls":7},"OTDK / TDK helyezés:",{"$nulls":7},"OTDK / TDK helyezés:",{"$nulls":7},"OTDK / TDK helyezés:",{"$nulls":7},"OTDK / TDK helyezés:",{"$nulls":7},"OTDK / TDK helyezés:",{"$nulls":7},"OTDK / TDK helyezés:",{"$nulls":7},"OTDK / TDK helyezés:",{"$nulls":7},"OTDK / TDK helyezés:",{"$nulls":7},"OTDK / TDK helyezés:",{"$nulls":7},"OTDK / TDK helyezés:",{"$nulls":7},"OTDK / TDK helyezés:",{"$nulls":7},"OTDK / TDK helyezés:",{"$nulls":7},"OTDK / TDK helyezés:",{"$nulls":7},"OTDK / TDK helyezés:",{"$nulls":7},"OTDK / TDK helyezés:",{"$nulls":7},"OTDK / TDK helyezés:",{"$nulls":7},"OTDK / TDK helyezés:",{"$nulls":7},"OTDK / TDK helyezés:",{"$nulls":7},"OTDK / TDK helyezés:",{"$nulls":7},"OTDK / TDK helyezés:",{"$nulls":7},"OTDK / TDK helyezés:",{"$nulls":7},"OTDK / TDK helyezés:",{"$nulls":7},"OTDK / TDK helyezés:",{"$nulls":7},"OTDK / TDK helyezés:",{"$nulls":7},"OTDK / TDK helyezés:",{"$nulls":7},"OTDK / TDK helyezés:",{"$nulls":7},"OTDK / TDK helyezés:",{"$nulls":7},"OTDK / TDK helyezés:",{"$nulls":7},"OTDK / TDK helyezés:",{"$nulls":7},"OTDK / TDK helyezés:",{"$nulls":7},"OTDK / TDK helyezés:",{"$nulls":7},"OTDK / TDK helyezés:",{"$nulls":7},"OTDK / TDK helyezés:",{"$nulls":7},"OTDK / TDK helyezés:",{"$nulls":7},"OTDK / TDK helyezés:",{"$nulls":7},"OTDK / TDK helyezés:",{"$nulls":7},"OTDK / TDK helyezés:",{"$nulls":7},"OTDK / TDK helyezés:",{"$nulls":7},"OTDK / TDK helyezés:",{"$nulls":7},"OTDK / TDK helyezés:",{"$nulls":7},"OTDK / TDK helyezés:",{"$nulls":7},"OTDK / TDK helyezés:",{"$nulls":7},"OTDK / TDK helyezés:",{"$nulls":7},"OTDK / TDK helyezés:",{"$nulls":7},"OTDK / TDK helyezés:",{"$nulls":7},"OTDK / TDK helyezés:",{"$nulls":7},"OTDK / TDK helyezés:",{"$nulls":7},"OTDK / TDK helyezés:",{"$nulls":7},"OTDK / TDK helyezés:",{"$nulls":7},"OTDK / TDK helyezés:",{"$nulls":7},"OTDK / TDK helyezés:",{"$nulls":7},"OTDK / TDK helyezés:",{"$nulls":7},"OTDK / TDK helyezés:",{"$nulls":7},"OTDK / TDK helyezés:",{"$nulls":7},"OTDK / TDK helyezés:",{"$nulls":7},"OTDK / TDK helyezés:",{"$nulls":7},"OTDK / TDK helyezés:",{"$nulls":7},"OTDK / TDK helyezés:",{"$nulls":7},"OTDK / TDK helyezés:",{"$nulls":7},"OTDK / TDK helyezés:",{"$nulls":7},"OTDK / TDK helyezés:",{"$nulls":7},"OTDK / TDK helyezés:",{"$nulls":7},"OTDK / TDK helyezés:",{"$nulls":7},"OTDK / TDK helyezés:",{"$nulls":7},"OTDK / TDK helyezés:",{"$nulls":7},"OTDK / TDK helyezés:",{"$nulls":7},"OTDK / TDK helyezés:",{"$nulls":7},"OTDK / TDK helyezés:",{"$nulls":7},"OTDK / TDK helyezés:",{"$nulls":7},"OTDK / TDK helyezés:",{"$nulls":7},"OTDK / TDK helyezés:",{"$nulls":7},"OTDK / TDK helyezés:",{"$nulls":7},"OTDK / TDK helyezés:",{"$nulls":7},"OTDK / TDK helyezés:",{"$nulls":7},"OTDK / TDK helyezés:",{"$nulls":7},"OTDK / TDK helyezés:",{"$nulls":7},"OTDK / TDK helyezés:",{"$nulls":7},"OTDK / TDK helyezés:",{"$nulls":7},"OTDK / TDK helyezés:",{"$nulls":7},"OTDK / TDK helyezés:",{"$nulls":7},"OTDK / TDK helyezés:",{"$nulls":7},"OTDK / TDK helyezés:",{"$nulls":7},"OTDK / TDK helyezés:",{"$nulls":7},"OTDK / TDK helyezés:",{"$nulls":7},"OTDK / TDK helyezés:",{"$nulls":7},"OTDK / TDK helyezés:",{"$nulls":7},"OTDK / TDK helyezés:",{"$nulls":7},"OTDK / TDK helyezés:",{"$nulls":7},"OTDK / TDK helyezés:",{"$nulls":7},"OTDK / TDK helyezés:",{"$nulls":7},"OTDK / TDK helyezés:",{"$nulls":7},"OTDK / TDK helyezés:",{"$nulls":7},"OTDK / TDK helyezés:",{"$nulls":7},"OTDK / TDK helyezés:",{"$nulls":7},"OTDK / TDK helyezés:",{"$nulls":7},"OTDK / TDK helyezés:",{"$nulls":7},"OTDK / TDK helyezés:",{"$nulls":7},"OTDK / TDK helyezés:",{"$nulls":7},"OTDK / TDK helyezés:",{"$nulls":7},"OTDK / TDK helyezés:",{"$nulls":7},"OTDK / TDK helyezés:",{"$nulls":7},"OTDK / TDK helyezés:",{"$nulls":7},"OTDK / TDK helyezés:",{"$nulls":7},"OTDK / TDK helyezés:",{"$nulls":7},"OTDK / TDK helyezés:",{"$nulls":7},"OTDK / TDK helyezés:",{"$nulls":7},"OTDK / TDK helyezés:",{"$nulls":7},"OTDK / TDK helyezés:",{"$nulls":7},"OTDK / TDK helyezés:",{"$nulls":7},"OTDK / TDK helyezés:",{"$nulls":7},"OTDK / TDK helyezés:",{"$nulls":7},"OTDK / TDK helyezés:",{"$nulls":7},"OTDK / TDK helyezés:",{"$nulls":7},"OTDK / TDK helyezés:",{"$nulls":7},"OTDK / TDK helyezés:",{"$nulls":7},"OTDK / TDK helyezés:",{"$nulls":7},"OTDK / TDK helyezés:",{"$nulls":7},"OTDK / TDK helyezés:",{"$nulls":7},"OTDK / TDK helyezés:",{"$nulls":7},"OTDK / TDK helyezés:",{"$nulls":7},"OTDK / TDK helyezés:",{"$nulls":7},"OTDK / TDK helyezés:",{"$nulls":7},"OTDK / TDK helyezés:",{"$nulls":7},"OTDK / TDK helyezés:",{"$nulls":7},"OTDK / TDK helyezés:",{"$nulls":7},"OTDK / TDK helyezés:",{"$nulls":7},"OTDK / TDK helyezés:",{"$nulls":7},"OTDK / TDK helyezés:",{"$nulls":7},"OTDK / TDK helyezés:",{"$nulls":7},"OTDK / TDK helyezés:",{"$nulls":7},"OTDK / TDK helyezés:",{"$nulls":7},"OTDK / TDK helyezés:",{"$nulls":7},"OTDK / TDK helyezés:",{"$nulls":7},"OTDK / TDK helyezés:",{"$nulls":7},"OTDK / TDK helyezés:",{"$nulls":7},"OTDK / TDK helyezés:",{"$nulls":7},"OTDK / TDK helyezés:",{"$nulls":7},"OTDK / TDK helyezés:",{"$nulls":7},"OTDK / TDK helyezés:",{"$nulls":7},"OTDK / TDK helyezés:",{"$nulls":7},"OTDK / TDK helyezés:",{"$nulls":7},"OTDK / TDK helyezés:",{"$nulls":7},"OTDK / TDK helyezés:",{"$nulls":7},"OTDK / TDK helyezés:",{"$nulls":7},"OTDK / TDK helyezés:",{"$nulls":7},"OTDK / TDK helyezés:",{"$nulls":7},"OTDK / TDK helyezés:",{"$nulls":7},"OTDK / TDK helyezés:",{"$nulls":7},"OTDK / TDK helyezés:",{"$nulls":7},"OTDK / TDK helyezés:",{"$nulls":7},"OTDK / TDK helyezés:",{"$nulls":7},"OTDK / TDK helyezés:",{"$nulls":7},"OTDK / TDK helyezés:",{"$nulls":7},"OTDK / TDK helyezés:",{"$nulls":7},"OTDK / TDK helyezés:",{"$nulls":7},"OTDK / TDK helyezés:",{"$nulls":7},"OTDK / TDK helyezés:",{"$nulls":7},"OTDK / TDK helyezés:",{"$nulls":7},"OTDK / TDK helyezés:",{"$nulls":7},"OTDK / TDK helyezés:",{"$nulls":7},"OTDK / TDK helyezés:",{"$nulls":7},"OTDK / TDK helyezés:",{"$nulls":7},"OTDK / TDK helyezés:",{"$nulls":7},"OTDK / TDK helyezés:",{"$nulls":7},"OTDK / TDK helyezés:",{"$nulls":7},"OTDK / TDK helyezés:",{"$nulls":7},"OTDK / TDK helyezés:",{"$nulls":7},"OTDK / TDK helyezés:",{"$nulls":7},"OTDK / TDK helyezés:",{"$nulls":7},"OTDK / TDK helyezés:",{"$nulls":7},"OTDK / TDK helyezés:",{"$nulls":7},"OTDK / TDK helyezés:",{"$nulls":7},"OTDK / TDK helyezés:",{"$nulls":7},"OTDK / TDK helyezés:",{"$nulls":7},"OTDK / TDK helyezés:",{"$nulls":7},"OTDK / TDK helyezés:",{"$nulls":7},"OTDK / TDK helyezés:",{"$nulls":7},"OTDK / TDK helyezés:",{"$nulls":7},"OTDK / TDK helyezés:",{"$nulls":7},"OTDK / TDK helyezés:",{"$nulls":7},"OTDK / TDK helyezés:",{"$nulls":7},"OTDK / TDK helyezés:",{"$nulls":7},"OTDK / TDK helyezés:",{"$nulls":7},"OTDK / TDK helyezés:",{"$nulls":7},"OTDK / TDK helyezés:",{"$nulls":7},"OTDK / TDK helyezés:",{"$nulls":7},"OTDK / TDK helyezés:",{"$nulls":7},"OTDK / TDK helyezés:",{"$nulls":7},"OTDK / TDK helyezés:",{"$nulls":7},"OTDK / TDK helyezés:",{"$nulls":7},"OTDK / TDK helyezés:",{"$nulls":7},"OTDK / TDK helyezés:",{"$nulls":7},"OTDK / TDK helyezés:",{"$nulls":7},"OTDK / TDK helyezés:",{"$nulls":7},"OTDK / TDK helyezés:",{"$nulls":7},"OTDK / TDK helyezés:",{"$nulls":7},"OTDK / TDK helyezés:",{"$nulls":7},"OTDK / TDK helyezés:",{"$nulls":7},"OTDK / TDK helyezés:",{"$nulls":7},"OTDK / TDK helyezés:",{"$nulls":7},"OTDK / TDK helyezés:",{"$nulls":7},"OTDK / TDK helyezés:",{"$nulls":7},"OTDK / TDK helyezés:",{"$nulls":7},"OTDK / TDK helyezés:",{"$nulls":7},"OTDK / TDK helyezés:",{"$nulls":7},"OTDK / TDK helyezés:",{"$nulls":7},"OTDK / TDK helyezés:",{"$nulls":7},"OTDK / TDK helyezés:",{"$nulls":7},"OTDK / TDK helyezés:",{"$nulls":7},"OTDK / TDK helyezés:",{"$nulls":7},"OTDK / TDK helyezés:",{"$nulls":7},"OTDK / TDK helyezés:",{"$nulls":7},"OTDK / TDK helyezés:",{"$nulls":7},"OTDK / TDK helyezés:",{"$nulls":7},"OTDK / TDK helyezés:",{"$nulls":7},"OTDK / TDK helyezés:",{"$nulls":7},"OTDK / TDK helyezés:",{"$nulls":7},"OTDK / TDK helyezés:",{"$nulls":7},"OTDK / TDK helyezés:",{"$nulls":7},"OTDK / TDK helyezés:",{"$nulls":7},"OTDK / TDK helyezés:",{"$nulls":7},"OTDK / TDK helyezés:",{"$nulls":7},"OTDK / TDK helyezés:",{"$nulls":7},"OTDK / TDK helyezés:",{"$nulls":7},"OTDK / TDK helyezés:",{"$nulls":7},"OTDK / TDK helyezés:",{"$nulls":7},"OTDK / TDK helyezés:",{"$nulls":7},"OTDK / TDK helyezés:",{"$nulls":7},"OTDK / TDK helyezés:",{"$nulls":7},"OTDK / TDK helyezés:",{"$nulls":7},"OTDK / TDK helyezés:",{"$nulls":7},"OTDK / TDK helyezés:",{"$nulls":7},"OTDK / TDK helyezés:",{"$nulls":7},"OTDK / TDK helyezés:",{"$nulls":7},"OTDK / TDK helyezés:",{"$nulls":7},"OTDK / TDK helyezés:",{"$nulls":7},"OTDK / TDK helyezés:",{"$nulls":7},"OTDK / TDK helyezés:",{"$nulls":7},"OTDK / TDK helyezés:",{"$nulls":7},"OTDK / TDK helyezés:",{"$nulls":7},"OTDK / TDK helyezés:",{"$nulls":7},"OTDK / TDK helyezés:",{"$nulls":7},"OTDK / TDK helyezés:",{"$nulls":7},"OTDK / TDK helyezés:",{"$nulls":7},"OTDK / TDK helyezés:",{"$nulls":7},"OTDK / TDK helyezés:",{"$nulls":7},"OTDK / TDK helyezés:",{"$nulls":7},"OTDK / TDK helyezés:",{"$nulls":7},"OTDK / TDK helyezés:",{"$nulls":7},"OTDK / TDK helyezés:",{"$nulls":7},"OTDK / TDK helyezés:",{"$nulls":7},"OTDK / TDK helyezés:",{"$nulls":7},"OTDK / TDK helyezés:",{"$nulls":7},"OTDK / TDK helyezés:",{"$nulls":7},"OTDK / TDK helyezés:",{"$nulls":7},"OTDK / TDK helyezés:",{"$nulls":7},"OTDK / TDK helyezés:",{"$nulls":7},"OTDK / TDK helyezés:",{"$nulls":7},"OTDK / TDK helyezés:",{"$nulls":7},"OTDK / TDK helyezés:",{"$nulls":7},"OTDK / TDK helyezés:",{"$nulls":7},"OTDK / TDK helyezés:",{"$nulls":7},"OTDK / TDK helyezés:",{"$nulls":7},"OTDK / TDK helyezés:",{"$nulls":7},"OTDK / TDK helyezés:",{"$nulls":7},"OTDK / TDK helyezés:",{"$nulls":7},"OTDK / TDK helyezés:",{"$nulls":7},"OTDK / TDK helyezés:",{"$nulls":7},"OTDK / TDK helyezés:",{"$nulls":7},"OTDK / TDK helyezés:",{"$nulls":7},"OTDK / TDK helyezés:",{"$nulls":7},"OTDK / TDK helyezés:",{"$nulls":7},"OTDK / TDK helyezés:",{"$nulls":7},"OTDK / TDK helyezés:",{"$nulls":7},"OTDK / TDK helyezés:",{"$nulls":7},"OTDK / TDK helyezés:",{"$nulls":7},"OTDK / TDK helyezés:",{"$nulls":7},"OTDK / TDK helyezés:",{"$nulls":7},"OTDK / TDK helyezés:",{"$nulls":7},"OTDK / TDK helyezés:",{"$nulls":7},"OTDK / TDK helyezés:",{"$nulls":7},"OTDK / TDK helyezés:",{"$nulls":7},"OTDK / TDK helyezés:",{"$nulls":7},"OTDK / TDK helyezés:",{"$nulls":7},"OTDK / TDK helyezés:",{"$nulls":7},"OTDK / TDK helyezés:",{"$nulls":7},"OTDK / TDK helyezés:",{"$nulls":7},"OTDK / TDK helyezés:",{"$nulls":7},"OTDK / TDK helyezés:",{"$nulls":7},"OTDK / TDK helyezés:",{"$nulls":7},"OTDK / TDK helyezés:",{"$nulls":7},"OTDK / TDK helyezés:",{"$nulls":7},"OTDK / TDK helyezés:",{"$nulls":7},"OTDK / TDK helyezés:",{"$nulls":7},"OTDK / TDK helyezés:",{"$nulls":7},"OTDK / TDK helyezés:",{"$nulls":7},"OTDK / TDK helyezés:",{"$nulls":7},"OTDK / TDK helyezés:",{"$nulls":7},"OTDK / TDK helyezés:",{"$nulls":7},"OTDK / TDK helyezés:",{"$nulls":7},"OTDK / TDK helyezés:",{"$nulls":7},"OTDK / TDK helyezés:",{"$nulls":7},"OTDK / TDK helyezés:",{"$nulls":7},"OTDK / TDK helyezés:",{"$nulls":7},"OTDK / TDK helyezés:",{"$nulls":7},"OTDK / TDK helyezés:",{"$nulls":7},"OTDK / TDK helyezés:",{"$nulls":7},"OTDK / TDK helyezés:",{"$nulls":7},"OTDK / TDK helyezés:",{"$nulls":7},"OTDK / TDK helyezés:",{"$nulls":7},"OTDK / TDK helyezés:",{"$nulls":7},"OTDK / TDK helyezés:",{"$nulls":7},"OTDK / TDK helyezés:",{"$nulls":7},"OTDK / TDK helyezés:",{"$nulls":7},"OTDK / TDK helyezés:",{"$nulls":7},"OTDK / TDK helyezés:",{"$nulls":7},"OTDK / TDK helyezés:",{"$nulls":7},"OTDK / TDK helyezés:",{"$nulls":7},"OTDK / TDK helyezés:",{"$nulls":7},"OTDK / TDK helyezés:",{"$nulls":7},"OTDK / TDK helyezés:",{"$nulls":7},"OTDK / TDK helyezés:",{"$nulls":7},"OTDK / TDK helyezés:",{"$nulls":7},"OTDK / TDK helyezés:",{"$nulls":7},"OTDK / TDK helyezés:",{"$nulls":7},"OTDK / TDK helyezés:",{"$nulls":7},"OTDK / TDK helyezés:",{"$nulls":7},"OTDK / TDK helyezés:",{"$nulls":7},"OTDK / TDK helyezés:",{"$nulls":7},"OTDK / TDK helyezés:",{"$nulls":7},"OTDK / TDK helyezés:",{"$nulls":7},"OTDK / TDK helyezés:",{"$nulls":7},"OTDK / TDK helyezés:",{"$nulls":7},"OTDK / TDK helyezés:",{"$nulls":7},"OTDK / TDK helyezés:",{"$nulls":7},"OTDK / TDK helyezés:",{"$nulls":7},"OTDK / TDK helyezés:",{"$nulls":7},"OTDK / TDK helyezés:",{"$nulls":7},"OTDK / TDK helyezés:",{"$nulls":7},"OTDK / TDK helyezés:",{"$nulls":7},"OTDK / TDK helyezés:",{"$nulls":7},"OTDK / TDK helyezés:",{"$nulls":7},"OTDK / TDK helyezés:",{"$nulls":7},"OTDK / TDK helyezés:",{"$nulls":7},"OTDK / TDK helyezés:",{"$nulls":7},"OTDK / TDK helyezés:",{"$nulls":7},"OTDK / TDK helyezés:",{"$nulls":7},"OTDK / TDK helyezés:",{"$nulls":7},"OTDK / TDK helyezés:",{"$nulls":7},"OTDK / TDK helyezés:",{"$nulls":7},"OTDK / TDK helyezés:",{"$nulls":7},"OTDK / TDK helyezés:",{"$nulls":7},"OTDK / TDK helyezés:",{"$nulls":7},"OTDK / TDK helyezés:",{"$nulls":7},"OTDK / TDK helyezés:",{"$nulls":7},"OTDK / TDK helyezés:",{"$nulls":7},"OTDK / TDK helyezés:",{"$nulls":7},"OTDK / TDK helyezés:",{"$nulls":7},"OTDK / TDK helyezés:",{"$nulls":7},"OTDK / TDK helyezés:",{"$nulls":7},"OTDK / TDK helyezés:",{"$nulls":7},"OTDK / TDK helyezés:",{"$nulls":7},"OTDK / TDK helyezés:",{"$nulls":7},"OTDK / TDK helyezés:",{"$nulls":7},"OTDK / TDK helyezés:",{"$nulls":7},"OTDK / TDK helyezés:",{"$nulls":7},"OTDK / TDK helyezés:",{"$nulls":7},"OTDK / TDK helyezés:",{"$nulls":7},"OTDK / TDK helyezés:",{"$nulls":7},"OTDK / TDK helyezés:",{"$nulls":7},"OTDK / TDK helyezés:",{"$nulls":7},"OTDK / TDK helyezés:",{"$nulls":7},"OTDK / TDK helyezés:",{"$nulls":7},"OTDK / TDK helyezés:",{"$nulls":7},"OTDK / TDK helyezés:",{"$nulls":7},"OTDK / TDK helyezés:",{"$nulls":7},"OTDK / TDK helyezés:",{"$nulls":7},"OTDK / TDK helyezés:",{"$nulls":7},"OTDK / TDK helyezés:",{"$nulls":7},"OTDK / TDK helyezés:",{"$nulls":7},"OTDK / TDK helyezés:",{"$nulls":7},"OTDK / TDK helyezés:",{"$nulls":7},"OTDK / TDK helyezés:",{"$nulls":7},"OTDK / TDK helyezés:",{"$nulls":7},"OTDK / TDK helyezés:",{"$nulls":7},"OTDK / TDK helyezés:",{"$nulls":7},"OTDK / TDK helyezés:",{"$nulls":7},"OTDK / TDK helyezés:",{"$nulls":7},"OTDK / TDK helyezés:",{"$nulls":7},"OTDK / TDK helyezés:",{"$nulls":7},"OTDK / TDK helyezés:",{"$nulls":7},"OTDK / TDK helyezés:",{"$nulls":7},"OTDK / TDK helyezés:",{"$nulls":7},"OTDK / TDK helyezés:",{"$nulls":7},"OTDK / TDK helyezés:",{"$nulls":7},"OTDK / TDK helyezés:",{"$nulls":7},"OTDK / TDK helyezés:",{"$nulls":7},"OTDK / TDK helyezés:",{"$nulls":7},"OTDK / TDK helyezés:",{"$nulls":7},"OTDK / TDK helyezés:",{"$nulls":7},"OTDK / TDK helyezés:",{"$nulls":7},"OTDK / TDK helyezés:",{"$nulls":7},"OTDK / TDK helyezés:",{"$nulls":7},"OTDK / TDK helyezés:",{"$nulls":7},"OTDK / TDK helyezés:",{"$nulls":7},"OTDK / TDK helyezés:",{"$nulls":7},"OTDK / TDK helyezés:",{"$nulls":7},"OTDK / TDK helyezés:",{"$nulls":7},"OTDK / TDK helyezés:",{"$nulls":7},"OTDK / TDK helyezés:",{"$nulls":7},"OTDK / TDK helyezés:",{"$nulls":7},"OTDK / TDK helyezés:",{"$nulls":7},"OTDK / TDK helyezés:",{"$nulls":7},"OTDK / TDK helyezés:",{"$nulls":7},"OTDK / TDK helyezés:",{"$nulls":7},"OTDK / TDK helyezés:",{"$nulls":7},"OTDK / TDK helyezés:",{"$nulls":7},"OTDK / TDK helyezés:",{"$nulls":7},"OTDK / TDK helyezés:",{"$nulls":7},"OTDK / TDK helyezés:",{"$nulls":7},"OTDK / TDK helyezés:",{"$nulls":7},"OTDK / TDK helyezés:",{"$nulls":7},"OTDK / TDK helyezés:",{"$nulls":7},"OTDK / TDK helyezés:",{"$nulls":7},"OTDK / TDK helyezés:",{"$nulls":7},"OTDK / TDK helyezés:",{"$nulls":7},"OTDK / TDK helyezés:",{"$nulls":7},"OTDK / TDK helyezés:",{"$nulls":7},"OTDK / TDK helyezés:",{"$nulls":7},"OTDK / TDK helyezés:",{"$nulls":7},"OTDK / TDK helyezés:",{"$nulls":7},"OTDK / TDK helyezés:",{"$nulls":7},"OTDK / TDK helyezés:",{"$nulls":7},"OTDK / TDK helyezés:",{"$nulls":7},"OTDK / TDK helyezés:",{"$nulls":7},"OTDK / TDK helyezés:",{"$nulls":7},"OTDK / TDK helyezés:",{"$nulls":7},"OTDK / TDK helyezés:",{"$nulls":7},"OTDK / TDK helyezés:",{"$nulls":7},"OTDK / TDK helyezés:",{"$nulls":7},"OTDK / TDK helyezés:",{"$nulls":7},"OTDK / TDK helyezés:",{"$nulls":7},"OTDK / TDK helyezés:",{"$nulls":7},"OTDK / TDK helyezés:",{"$nulls":7},"OTDK / TDK helyezés:",{"$nulls":7},"OTDK / TDK helyezés:",{"$nulls":7},"OTDK / TDK helyezés:",{"$nulls":7},"OTDK / TDK helyezés:",{"$nulls":7},"OTDK / TDK helyezés:",{"$nulls":7},"OTDK / TDK helyezés:",{"$nulls":7},"OTDK / TDK helyezés:",{"$nulls":7},"OTDK / TDK helyezés:",{"$nulls":7},"OTDK / TDK helyezés:",{"$nulls":7},"OTDK / TDK helyezés:",{"$nulls":7},"OTDK / TDK helyezés:",{"$nulls":7},"OTDK / TDK helyezés:",{"$nulls":7},"OTDK / TDK helyezés:",{"$nulls":7},"OTDK / TDK helyezés:",{"$nulls":7},"OTDK / TDK helyezés:",{"$nulls":7},"OTDK / TDK helyezés:",{"$nulls":7},"OTDK / TDK helyezés:",{"$nulls":7},"OTDK / TDK helyezés:",{"$nulls":7},"OTDK / TDK helyezés:",{"$nulls":7},"OTDK / TDK helyezés:",{"$nulls":7},"OTDK / TDK helyezés:",{"$nulls":7},"OTDK / TDK helyezés:",{"$nulls":7},"OTDK / TDK helyezés:",{"$nulls":7},"OTDK / TDK helyezés:",{"$nulls":7},"OTDK / TDK helyezés:",{"$nulls":7},"OTDK / TDK helyezés:",{"$nulls":7},"OTDK / TDK helyezés:",{"$nulls":7},"OTDK / TDK helyezés:",{"$nulls":7},"OTDK / TDK helyezés:",{"$nulls":7},"OTDK / TDK helyezés:",{"$nulls":7},"OTDK / TDK helyezés:",{"$nulls":7},"OTDK / TDK helyezés:",{"$nulls":7},"OTDK / TDK helyezés:",{"$nulls":7},"OTDK / TDK helyezés:",{"$nulls":7},"OTDK / TDK helyezés:",{"$nulls":7},"OTDK / TDK helyezés:",{"$nulls":7},"OTDK / TDK helyezés:",{"$nulls":7},"OTDK / TDK helyezés:",{"$nulls":7},"OTDK / TDK helyezés:",{"$nulls":7},"OTDK / TDK helyezés:",{"$nulls":7},"OTDK / TDK helyezés:",{"$nulls":7},"OTDK / TDK helyezés:",{"$nulls":7},"OTDK / TDK helyezés:",{"$nulls":7},"OTDK / TDK helyezés:",{"$nulls":7},"OTDK / TDK helyezés:",{"$nulls":7},"OTDK / TDK helyezés:",{"$nulls":7},"OTDK / TDK helyezés:",{"$nulls":7},"OTDK / TDK helyezés:",{"$nulls":7},"OTDK / TDK helyezés:",{"$nulls":7},"OTDK / TDK helyezés:",{"$nulls":7},"OTDK / TDK helyezés:",{"$nulls":7},"OTDK / TDK helyezés:",{"$nulls":7},"OTDK / TDK helyezés:",{"$nulls":7},"OTDK / TDK helyezés:",{"$nulls":7},"OTDK / TDK helyezés:",{"$nulls":7},"OTDK / TDK helyezés:",{"$nulls":7},"OTDK / TDK helyezés:",{"$nulls":7},"OTDK / TDK helyezés:",{"$nulls":7},"OTDK / TDK helyezés:",{"$nulls":7},"OTDK / TDK helyezés:",{"$nulls":7},"OTDK / TDK helyezés:",{"$nulls":7},"OTDK / TDK helyezés:",{"$nulls":7},"OTDK / TDK helyezés:",{"$nulls":7},"OTDK / TDK helyezés:",{"$nulls":7},"OTDK / TDK helyezés:",{"$nulls":7},"OTDK / TDK helyezés:",{"$nulls":7},"OTDK / TDK helyezés:",{"$nulls":7},"OTDK / TDK helyezés:",{"$nulls":7},"OTDK / TDK helyezés:",{"$nulls":7},"OTDK / TDK helyezés:",{"$nulls":7},"OTDK / TDK helyezés:",{"$nulls":7},"OTDK / TDK helyezés:",{"$nulls":7},"OTDK / TDK helyezés:",{"$nulls":7},"OTDK / TDK helyezés:",{"$nulls":7},"OTDK / TDK helyezés:",{"$nulls":7},"OTDK / TDK helyezés:",{"$nulls":7},"OTDK / TDK helyezés:",{"$nulls":7},"OTDK / TDK helyezés:",{"$nulls":7},"OTDK / TDK helyezés:",{"$nulls":7},"OTDK / TDK helyezés:",{"$nulls":7},"OTDK / TDK helyezés:",{"$nulls":7},"OTDK / TDK helyezés:",{"$nulls":7},"OTDK / TDK helyezés:",{"$nulls":7},"OTDK / TDK helyezés:",{"$nulls":7},"OTDK / TDK helyezés:",{"$nulls":7},"OTDK / TDK helyezés:",{"$nulls":7},"OTDK / TDK helyezés:",{"$nulls":7},"OTDK / TDK helyezés:",{"$nulls":7},"OTDK / TDK helyezés:",{"$nulls":7},"OTDK / TDK helyezés:",{"$nulls":7},"OTDK / TDK helyezés:",{"$nulls":7},"OTDK / TDK helyezés:",{"$nulls":7},"OTDK / TDK helyezés:",{"$nulls":7},"OTDK / TDK helyezés:",{"$nulls":7},"OTDK / TDK helyezés:",{"$nulls":7},"OTDK / TDK helyezés:",{"$nulls":7},"OTDK / TDK helyezés:",{"$nulls":7},"OTDK / TDK helyezés:",{"$nulls":7},"OTDK / TDK helyezés:",{"$nulls":7},"OTDK / TDK helyezés:",{"$nulls":7},"OTDK / TDK helyezés:",{"$nulls":7},"OTDK / TDK helyezés:",{"$nulls":7},"OTDK / TDK helyezés:",{"$nulls":7},"OTDK / TDK helyezés:",{"$nulls":7},"OTDK / TDK helyezés:",{"$nulls":7},"OTDK / TDK helyezés:",{"$nulls":7},"OTDK / TDK helyezés:",{"$nulls":7},"OTDK / TDK helyezés:",{"$nulls":7},"OTDK / TDK helyezés:",{"$nulls":7},"OTDK / TDK helyezés:",{"$nulls":7},"OTDK / TDK helyezés:",{"$nulls":7},"OTDK / TDK helyezés:",{"$nulls":7},"OTDK / TDK helyezés:",{"$nulls":7},"OTDK / TDK helyezés:",{"$nulls":7},"OTDK / TDK helyezés:",{"$nulls":7},"OTDK / TDK helyezés:",{"$nulls":7},"OTDK / TDK helyezés:",{"$nulls":7},"OTDK / TDK helyezés:",{"$nulls":7},"OTDK / TDK helyezés:",{"$nulls":7},"OTDK / TDK helyezés:",{"$nulls":7},"OTDK / TDK helyezés:",{"$nulls":7},"OTDK / TDK helyezés:",{"$nulls":7},"OTDK / TDK helyezés:",{"$nulls":7},"OTDK / TDK helyezés:",{"$nulls":7},"OTDK / TDK helyezés:",{"$nulls":7},"OTDK / TDK helyezés:",{"$nulls":7},"OTDK / TDK helyezés:",{"$nulls":7},"OTDK / TDK helyezés:",{"$nulls":7},"OTDK / TDK helyezés:",{"$nulls":7},"OTDK / TDK helyezés:",{"$nulls":7},"OTDK / TDK helyezés:",{"$nulls":7},"OTDK / TDK helyezés:",{"$nulls":7},"OTDK / TDK helyezés:",{"$nulls":7},"OTDK / TDK helyezés:",{"$nulls":7},"OTDK / TDK helyezés:",{"$nulls":7},"OTDK / TDK helyezés:",{"$nulls":7},"OTDK / TDK helyezés:",{"$nulls":7},"OTDK / TDK helyezés:",{"$nulls":7},"OTDK / TDK helyezés:",{"$nulls":7},"OTDK / TDK helyezés:",{"$nulls":7},"OTDK / TDK helyezés:",{"$nulls":7},"OTDK / TDK helyezés:",{"$nulls":7},"OTDK / TDK helyezés:",{"$nulls":7},"OTDK / TDK helyezés:",{"$nulls":7},"OTDK / TDK helyezés:",{"$nulls":7},"OTDK / TDK helyezés:",{"$nulls":7},"OTDK / TDK helyezés:",{"$nulls":7},"OTDK / TDK helyezés:",{"$nulls":7},"OTDK / TDK helyezés:",{"$nulls":7},"OTDK / TDK helyezés:",{"$nulls":7},"OTDK / TDK helyezés:",{"$nulls":7},"OTDK / TDK helyezés:",{"$nulls":7},"OTDK / TDK helyezés:",{"$nulls":7},"OTDK / TDK helyezés:",{"$nulls":7},"OTDK / TDK helyezés:",{"$nulls":7},"OTDK / TDK helyezés:",{"$nulls":7},"OTDK / TDK helyezés:",{"$nulls":7},"OTDK / TDK helyezés:",{"$nulls":7},"OTDK / TDK helyezés:",{"$nulls":7},"OTDK / TDK helyezés:",{"$nulls":7},"OTDK / TDK helyezés:",{"$nulls":7},"OTDK / TDK helyezés:",{"$nulls":7},"OTDK / TDK helyezés:",{"$nulls":7},"OTDK / TDK helyezés:",{"$nulls":7},"OTDK / TDK helyezés:",{"$nulls":7},"OTDK / TDK helyezés:",{"$nulls":7},"OTDK / TDK helyezés:",{"$nulls":7},"OTDK / TDK helyezés:",{"$nulls":7},"OTDK / TDK helyezés:",{"$nulls":7},"OTDK / TDK helyezés:",{"$nulls":7},"OTDK / TDK helyezés:",{"$nulls":7},"OTDK / TDK helyezés:",{"$nulls":7},"OTDK / TDK helyezés:",{"$nulls":7},"OTDK / TDK helyezés:",{"$nulls":7},"OTDK / TDK helyezés:",{"$nulls":7},"OTDK / TDK helyezés:",{"$nulls":7},"OTDK / TDK helyezés:",{"$nulls":7},"OTDK / TDK helyezés:",{"$nulls":7},"OTDK / TDK helyezés:",{"$nulls":7},"OTDK / TDK helyezés:",{"$nulls":7},"OTDK / TDK helyezés:",{"$nulls":7},"OTDK / TDK helyezés:",{"$nulls":7},"OTDK / TDK helyezés:",{"$nulls":7},"OTDK / TDK helyezés:",{"$nulls":7},"OTDK / TDK helyezés:",{"$nulls":7},"OTDK / TDK helyezés:",{"$nulls":7},"OTDK / TDK helyezés:",{"$nulls":7},"OTDK / TDK helyezés:",{"$nulls":7},"OTDK / TDK helyezés:",{"$nulls":7},"OTDK / TDK helyezés:",{"$nulls":7},"OTDK / TDK helyezés:",{"$nulls":7},"OTDK / TDK helyezés:",{"$nulls":7},"OTDK / TDK helyezés:",{"$nulls":7},"OTDK / TDK helyezés:",{"$nulls":7},"OTDK / TDK helyezés:",{"$nulls":7},"OTDK / TDK helyezés:",{"$nulls":7},"OTDK / TDK helyezés:",{"$nulls":7},"OTDK / TDK helyezés:",{"$nulls":7},"OTDK / TDK helyezés:",{"$nulls":7},"OTDK / TDK helyezés:",{"$nulls":7},"OTDK / TDK helyezés:",{"$nulls":7},"OTDK / TDK helyezés:",{"$nulls":7},"OTDK / TDK helyezés:",{"$nulls":7},"OTDK / TDK helyezés:",{"$nulls":7},"OTDK / TDK helyezés:",{"$nulls":7},"OTDK / TDK helyezés:",{"$nulls":7},"OTDK / TDK helyezés:",{"$nulls":7},"OTDK / TDK helyezés:",{"$nulls":7},"OTDK / TDK helyezés:",{"$nulls":7},"OTDK / TDK helyezés:",{"$nulls":7},"OTDK / TDK helyezés:",{"$nulls":7},"OTDK / TDK helyezés:",{"$nulls":7},"OTDK / TDK helyezés:",{"$nulls":7},"OTDK / TDK helyezés:",{"$nulls":7},"OTDK / TDK helyezés:",{"$nulls":7},"OTDK / TDK helyezés:",{"$nulls":7},"OTDK / TDK helyezés:",{"$nulls":7},"OTDK / TDK helyezés:",{"$nulls":7},"OTDK / TDK helyezés:",{"$nulls":7},"OTDK / TDK helyezés:",{"$nulls":7},"OTDK / TDK helyezés:",{"$nulls":7},"OTDK / TDK helyezés:",{"$nulls":7},"OTDK / TDK helyezés:",{"$nulls":7},"OTDK / TDK helyezés:",{"$nulls":7},"OTDK / TDK helyezés:",{"$nulls":7},"OTDK / TDK helyezés:",{"$nulls":7},"OTDK / TDK helyezés:",{"$nulls":7},"OTDK / TDK helyezés:",{"$nulls":7},"OTDK / TDK helyezés:",{"$nulls":7},"OTDK / TDK helyezés:",{"$nulls":7},"OTDK / TDK helyezés:",{"$nulls":7},"OTDK / TDK helyezés:",{"$nulls":7},"OTDK / TDK helyezés:",{"$nulls":7},"OTDK / TDK helyezés:",{"$nulls":7},"OTDK / TDK helyezés:",{"$nulls":7},"OTDK / TDK helyezés:",{"$nulls":7},"OTDK / TDK helyezés:",{"$nulls":7},"OTDK / TDK helyezés:",{"$nulls":7},"OTDK / TDK helyezés:",{"$nulls":7},"OTDK / TDK helyezés:",{"$nulls":7},"OTDK / TDK helyezés:",{"$nulls":7},"OTDK / TDK helyezés:",{"$nulls":7},"OTDK / TDK helyezés:",{"$nulls":7},"OTDK / TDK helyezés:",{"$nulls":7},"OTDK / TDK helyezés:",{"$nulls":7},"OTDK / TDK helyezés:",{"$nulls":7},"OTDK / TDK helyezés:",{"$nulls":7},"OTDK / TDK helyezés:",{"$nulls":7},"OTDK / TDK helyezés:",{"$nulls":7},"OTDK / TDK helyezés:",{"$nulls":7},"OTDK / TDK helyezés:",{"$nulls":7},"OTDK / TDK helyezés:",{"$nulls":7},"OTDK / TDK helyezés:",{"$nulls":7},"OTDK / TDK helyezés:",{"$nulls":7},"OTDK / TDK helyezés:",{"$nulls":7},"OTDK / TDK helyezés:",{"$nulls":7},"OTDK / TDK helyezés:",{"$nulls":7},"OTDK / TDK helyezés:",{"$nulls":7},"OTDK / TDK helyezés:",{"$nulls":7},"OTDK / TDK helyezés:",{"$nulls":7},"OTDK / TDK helyezés:",{"$nulls":7},"OTDK / TDK helyezés:",{"$nulls":7},"OTDK / TDK helyezés:",{"$nulls":7},"OTDK / TDK helyezés:",{"$nulls":7},"OTDK / TDK helyezés:",{"$nulls":7},"OTDK / TDK helyezés:",{"$nulls":7},"OTDK / TDK helyezés:",{"$nulls":7},"OTDK / TDK helyezés:",{"$nulls":7},"OTDK / TDK helyezés:",{"$nulls":7},"OTDK / TDK helyezés:",{"$nulls":7},"OTDK / TDK helyezés:",{"$nulls":7},"OTDK / TDK helyezés:",{"$nulls":7},"OTDK / TDK helyezés:",{"$nulls":7},"OTDK / TDK helyezés:",{"$nulls":7},"OTDK / TDK helyezés:",{"$nulls":7},"OTDK / TDK helyezés:",{"$nulls":7},"OTDK / TDK helyezés:",{"$nulls":7},"OTDK / TDK helyezés:",{"$nulls":7},"OTDK / TDK helyezés:",{"$nulls":7},"OTDK / TDK helyezés:",{"$nulls":7},"OTDK / TDK helyezés:",{"$nulls":7},"OTDK / TDK helyezés:",{"$nulls":7},"OTDK / TDK helyezés:",{"$nulls":7},"OTDK / TDK helyezés:",{"$nulls":7},"OTDK / TDK helyezés:",{"$nulls":7},"OTDK / TDK helyezés:",{"$nulls":7},"OTDK / TDK helyezés:",{"$nulls":7},"OTDK / TDK helyezés:",{"$nulls":7},"OTDK / TDK helyezés:",{"$nulls":7},"OTDK / TDK helyezés:",{"$nulls":7},"OTDK / TDK helyezés:",{"$nulls":7},"OTDK / TDK helyezés:",{"$nulls":7},"OTDK / TDK helyezés:",{"$nulls":7},"OTDK / TDK helyezés:",{"$nulls":7},"OTDK / TDK helyezés:",{"$nulls":7},"OTDK / TDK helyezés:",{"$nulls":7},"OTDK / TDK helyezés:",{"$nulls":7},"OTDK / TDK helyezés:",{"$nulls":7},"OTDK / TDK helyezés:",{"$nulls":7},"OTDK / TDK helyezés:",{"$nulls":7},"OTDK / TDK helyezés:",{"$nulls":7},"OTDK / TDK helyezés:",{"$nulls":7},"OTDK / TDK helyezés:",{"$nulls":7},"OTDK / TDK helyezés:",{"$nulls":7},"OTDK / TDK helyezés:",{"$nulls":7},"OTDK / TDK helyezés:",{"$nulls":7},"OTDK / TDK helyezés:",{"$nulls":7},"OTDK / TDK helyezés:",{"$nulls":7},"OTDK / TDK helyezés:",{"$nulls":7},"OTDK / TDK helyezés:",{"$nulls":7},"OTDK / TDK helyezés:",{"$nulls":7},"OTDK / TDK helyezés:",{"$nulls":7},"OTDK / TDK helyezés:",{"$nulls":7},"OTDK / TDK helyezés:",{"$nulls":7},"OTDK / TDK helyezés:",{"$nulls":7},"OTDK / TDK helyezés:",{"$nulls":7},"OTDK / TDK helyezés:",{"$nulls":7},"OTDK / TDK helyezés:",{"$nulls":7},"OTDK / TDK helyezés:",{"$nulls":7},"OTDK / TDK helyezés:",{"$nulls":7},"OTDK / TDK helyezés:",{"$nulls":7},"OTDK / TDK helyezés:",{"$nulls":7},"OTDK / TDK helyezés:",{"$nulls":7},"OTDK / TDK helyezés:",{"$nulls":7},"OTDK / TDK helyezés:",{"$nulls":7},"OTDK / TDK helyezés:",{"$nulls":7},"OTDK / TDK helyezés:",{"$nulls":7},"OTDK / TDK helyezés:",{"$nulls":7},"OTDK / TDK helyezés:",{"$nulls":7},"OTDK / TDK helyezés:",{"$nulls":7},"OTDK / TDK helyezés:",{"$nulls":7},"OTDK / TDK helyezés:",{"$nulls":7},"OTDK / TDK helyezés:",{"$nulls":7},"OTDK / TDK helyezés:",{"$nulls":7},"OTDK / TDK helyezés:",{"$nulls":7},"OTDK / TDK helyezés:",{"$nulls":7},"OTDK / TDK helyezés:",{"$nulls":7},"OTDK / TDK helyezés:",{"$nulls":7},"OTDK / TDK helyezés:",{"$nulls":7},"OTDK / TDK helyezés:",{"$nulls":7},"OTDK / TDK helyezés:",{"$nulls":7},"OTDK / TDK helyezés:",{"$nulls":7},"OTDK / TDK helyezés:",{"$nulls":7},"OTDK / TDK helyezés:",{"$nulls":7},"OTDK / TDK helyezés:",{"$nulls":7},"OTDK / TDK helyezés:",{"$nulls":7},"OTDK / TDK helyezés:",{"$nulls":7},"OTDK / TDK helyezés:",{"$nulls":7},"OTDK / TDK helyezés:",{"$nulls":7},"OTDK / TDK helyezés:",{"$nulls":7},"OTDK / TDK helyezés:",{"$nulls":7},"OTDK / TDK helyezés:",{"$nulls":7},"OTDK / TDK helyezés:",{"$nulls":7},"OTDK / TDK helyezés:",{"$nulls":7},"OTDK / TDK helyezés:",{"$nulls":7},"OTDK / TDK helyezés:",{"$nulls":7},"OTDK / TDK helyezés:",{"$nulls":7},"OTDK / TDK helyezés:",{"$nulls":7},"OTDK / TDK helyezés:",{"$nulls":7},"OTDK / TDK helyezés:",{"$nulls":7},"OTDK / TDK helyezés:",{"$nulls":7},"OTDK / TDK helyezés:",{"$nulls":7},"OTDK / TDK helyezés:",{"$nulls":7},"OTDK / TDK helyezés:",{"$nulls":7},"OTDK / TDK helyezés:",{"$nulls":7},"OTDK / TDK helyezés:",{"$nulls":7},"OTDK / TDK helyezés:",{"$nulls":7},"OTDK / TDK helyezés:",{"$nulls":7},"OTDK / TDK helyezés:",{"$nulls":7},"OTDK / TDK helyezés:",{"$nulls":7},"OTDK / TDK helyezés:",{"$nulls":7},"OTDK / TDK helyezés:",{"$nulls":7},"OTDK / TDK helyezés:",{"$nulls":7},"OTDK / TDK helyezés:",{"$nulls":7},"OTDK / TDK helyezés:",{"$nulls":7},"OTDK / TDK helyezés:",{"$nulls":7},"OTDK / TDK helyezés:",{"$nulls":7},"OTDK / TDK helyezés:",{"$nulls":7},"OTDK / TDK helyezés:",{"$nulls":7},"OTDK / TDK helyezés:",{"$nulls":7},"OTDK / TDK helyezés:",{"$nulls":7},"OTDK / TDK helyezés:",{"$nulls":7},"OTDK / TDK helyezés:",{"$nulls":7},"OTDK / TDK helyezés:",{"$nulls":7},"OTDK / TDK helyezés:",{"$nulls":7},"OTDK / TDK helyezés:",{"$nulls":7},"OTDK / TDK helyezés:",{"$nulls":7},"OTDK / TDK helyezés:",{"$nulls":7},"OTDK / TDK helyezés:",{"$nulls":7},"OTDK / TDK helyezés:",{"$nulls":7},"OTDK / TDK helyezés:",{"$nulls":7},"OTDK / TDK helyezés:",{"$nulls":7},"OTDK / TDK helyezés:",{"$nulls":7},"OTDK / TDK helyezés:",{"$nulls":7},"OTDK / TDK helyezés:",{"$nulls":7},"OTDK / TDK helyezés:",{"$nulls":7},"OTDK / TDK helyezés:",{"$nulls":7},"OTDK / TDK helyezés:",{"$nulls":7},"OTDK / TDK helyezés:",{"$nulls":7},"OTDK / TDK helyezés:",{"$nulls":7},"OTDK / TDK helyezés:",{"$nulls":7},"OTDK / TDK helyezés:",{"$nulls":7},"OTDK / TDK helyezés:",{"$nulls":7},"OTDK / TDK helyezés:",{"$nulls":7},"OTDK / TDK helyezés:",{"$nulls":7},"OTDK / TDK helyezés:",{"$nulls":7},"OTDK / TDK helyezés:",{"$nulls":7},"OTDK / TDK helyezés:",{"$nulls":7},"OTDK / TDK helyezés:",{"$nulls":7},"OTDK / TDK helyezés:",{"$nulls":7},"OTDK / TDK helyezés:",{"$nulls":7},"OTDK / TDK helyezés:",{"$nulls":7},"OTDK / TDK helyezés:",{"$nulls":7},"OTDK / TDK helyezés:",{"$nulls":7},"OTDK / TDK helyezés:",{"$nulls":7},"OTDK / TDK helyezés:",{"$nulls":7},"OTDK / TDK helyezés:",{"$nulls":7},"OTDK / TDK helyezés:",{"$nulls":7},"OTDK / TDK helyezés:",{"$nulls":7},"OTDK / TDK helyezés:",{"$nulls":7},"OTDK / TDK helyezés:",{"$nulls":7},"OTDK / TDK helyezés:",{"$nulls":7},"OTDK / TDK helyezés:",{"$nulls":7},"OTDK / TDK helyezés:",{"$nulls":7},"OTDK / TDK helyezés:",{"$nulls":7},"OTDK / TDK helyezés:",{"$nulls":7},"OTDK / TDK helyezés:",{"$nulls":7},"OTDK / TDK helyezés:",{"$nulls":7},"OTDK / TDK helyezés:",{"$nulls":7},"OTDK / TDK helyezés:",{"$nulls":7},"OTDK / TDK helyezés:",{"$nulls":7},"OTDK / TDK helyezés:",{"$nulls":7},"OTDK / TDK helyezés:",{"$nulls":7},"OTDK / TDK helyezés:",{"$nulls":7},"OTDK / TDK helyezés:",{"$nulls":7},"OTDK / TDK helyezés:",{"$nulls":7},"OTDK / TDK helyezés:",{"$nulls":7},"OTDK / TDK helyezés:",{"$nulls":7},"OTDK / TDK helyezés:",{"$nulls":7},"OTDK / TDK helyezés:",{"$nulls":7},"OTDK / TDK helyezés:",{"$nulls":7},"OTDK / TDK helyezés:",{"$nulls":7},"OTDK / TDK helyezés:",{"$nulls":7},"OTDK / TDK helyezés:",{"$nulls":7},"OTDK / TDK helyezés:",{"$nulls":7},"OTDK / TDK helyezés:",{"$nulls":7},"OTDK / TDK helyezés:",{"$nulls":7},"OTDK / TDK helyezés:",{"$nulls":7},"OTDK / TDK helyezés:",{"$nulls":7},"OTDK / TDK helyezés:",{"$nulls":7},"OTDK / TDK helyezés:",{"$nulls":7},"OTDK / TDK helyezés:",{"$nulls":7},"OTDK / TDK helyezés:",{"$nulls":7},"OTDK / TDK helyezés:",{"$nulls":7},"OTDK / TDK helyezés:",{"$nulls":7},"OTDK / TDK helyezés:",{"$nulls":7},"OTDK / TDK helyezés:",{"$nulls":7},"OTDK / TDK helyezés:",{"$nulls":7},"OTDK / TDK helyezés:",{"$nulls":7},"OTDK / TDK helyezés:",{"$nulls":7},"OTDK / TDK helyezés:",{"$nulls":7},"OTDK / TDK helyezés:",{"$nulls":7},"OTDK / TDK helyezés:",{"$nulls":7},"OTDK / TDK helyezés:",{"$nulls":7},"OTDK / TDK helyezés:",{"$nulls":7},"OTDK / TDK helyezés:",{"$nulls":7},"OTDK / TDK helyezés:",{"$nulls":7},"OTDK / TDK helyezés:",{"$nulls":7},"OTDK / TDK helyezés:",{"$nulls":7},"OTDK / TDK helyezés:",{"$nulls":7},"OTDK / TDK helyezés:",{"$nulls":7},"OTDK / TDK helyezés:",{"$nulls":7},"OTDK / TDK helyezés:",{"$nulls":7},"OTDK / TDK helyezés:",{"$nulls":7},"OTDK / TDK helyezés:",{"$nulls":7},"OTDK / TDK helyezés:",{"$nulls":7},"OTDK / TDK helyezés:",{"$nulls":7},"OTDK / TDK helyezés:",{"$nulls":7},"OTDK / TDK helyezés:",{"$nulls":7},"OTDK / TDK helyezés:",{"$nulls":7},"OTDK / TDK helyezés:",{"$nulls":7},"OTDK / TDK helyezés:",{"$nulls":7},"OTDK / TDK helyezés:",{"$nulls":7},"OTDK / TDK helyezés:",{"$nulls":7},"OTDK / TDK helyezés:",{"$nulls":7},"OTDK / TDK helyezés:",{"$nulls":7},"OTDK / TDK helyezés:",{"$nulls":7},"OTDK / TDK helyezés:",{"$nulls":7},"OTDK / TDK helyezés:",{"$nulls":7},"OTDK / TDK helyezés:",{"$nulls":7},"OTDK / TDK helyezés:",{"$nulls":7},"OTDK / TDK helyezés:",{"$nulls":7},"OTDK / TDK helyezés:",{"$nulls":7},"OTDK / TDK helyezés:",{"$nulls":7},"OTDK / TDK helyezés:",{"$nulls":7},"OTDK / TDK helyezés:",{"$nulls":7},"OTDK / TDK helyezés:",{"$nulls":7},"OTDK / TDK helyezés:",{"$nulls":7},"OTDK / TDK helyezés:",{"$nulls":7},"OTDK / TDK helyezés:",{"$nulls":7},"OTDK / TDK helyezés:",{"$nulls":7},"OTDK / TDK helyezés:",{"$nulls":7},"OTDK / TDK helyezés:",{"$nulls":7},"OTDK / TDK helyezés:",{"$nulls":7},"OTDK / TDK helyezés:",{"$nulls":7},"OTDK / TDK helyezés:",{"$nulls":7},"OTDK / TDK helyezés:",{"$nulls":7},"OTDK / TDK helyezés:",{"$nulls":7},"OTDK / TDK helyezés:",{"$nulls":7},"OTDK / TDK helyezés:",{"$nulls":7},"OTDK / TDK helyezés:",{"$nulls":7},"OTDK / TDK helyezés:",{"$nulls":7},"OTDK / TDK helyezés:",{"$nulls":7},"OTDK / TDK helyezés:",{"$nulls":7},"OTDK / TDK helyezés:",{"$nulls":7},"OTDK / TDK helyezés:",{"$nulls":7},"OTDK / TDK helyezés:",{"$nulls":7},"OTDK / TDK helyezés:",{"$nulls":7},"OTDK / TDK helyezés:",{"$nulls":7},"OTDK / TDK helyezés:",{"$nulls":7},"OTDK / TDK helyezés:",{"$nulls":7},"OTDK / TDK helyezés:",{"$nulls":7},"OTDK / TDK helyezés:",{"$nulls":7},"OTDK / TDK helyezés:",{"$nulls":7},"OTDK / TDK helyezés:",{"$nulls":7},"OTDK / TDK helyezés:",{"$nulls":7},"OTDK / TDK helyezés:",{"$nulls":7},"OTDK / TDK helyezés:",{"$nulls":7},"OTDK / TDK helyezés:",{"$nulls":7},"OTDK / TDK helyezés:",{"$nulls":7},"OTDK / TDK helyezés:",{"$nulls":7},"OTDK / TDK helyezés:",{"$nulls":7},"OTDK / TDK helyezés:",{"$nulls":7},"OTDK / TDK helyezés:",{"$nulls":7},"OTDK / TDK helyezés:",{"$nulls":7},"OTDK / TDK helyezés:",{"$nulls":7},"OTDK / TDK helyezés:",{"$nulls":7},"OTDK / TDK helyezés:",{"$nulls":7},"OTDK / TDK helyezés:",{"$nulls":7},"OTDK / TDK helyezés:",{"$nulls":7},"OTDK / TDK helyezés:",{"$nulls":7},"OTDK / TDK helyezés:",{"$nulls":7},"OTDK / TDK helyezés:",{"$nulls":7},"OTDK / TDK helyezés:",{"$nulls":7},"OTDK / TDK helyezés:",{"$nulls":7},"OTDK / TDK helyezés:",{"$nulls":7},"OTDK / TDK helyezés:",{"$nulls":7},"OTDK / TDK helyezés:",{"$nulls":7},"OTDK / TDK helyezés:",{"$nulls":7},"OTDK / TDK helyezés:",{"$nulls":7},"OTDK / TDK helyezés:",{"$nulls":7},"OTDK / TDK helyezés:",{"$nulls":7},"OTDK / TDK helyezés:",{"$nulls":7},"OTDK / TDK helyezés:",{"$nulls":7},"OTDK / TDK helyezés:",{"$nulls":7},"OTDK / TDK helyezés:",{"$nulls":7},"OTDK / TDK helyezés:",{"$nulls":7},"OTDK / TDK helyezés:",{"$nulls":7},"OTDK / TDK helyezés:",{"$nulls":7},"OTDK / TDK helyezés:",{"$nulls":7},"OTDK / TDK helyezés:",{"$nulls":7},"OTDK / TDK helyezés:",{"$nulls":7},"OTDK / TDK helyezés:",{"$nulls":7},"OTDK / TDK helyezés:",{"$nulls":7},"OTDK / TDK helyezés:",{"$nulls":7},"OTDK / TDK helyezés:",{"$nulls":7},"OTDK / TDK helyezés:",{"$nulls":7},"OTDK / TDK helyezés:",{"$nulls":7},"OTDK / TDK helyezés:",{"$nulls":7},"OTDK / TDK helyezés:",{"$nulls":7},"OTDK / TDK helyezés:",{"$nulls":7},"OTDK / TDK helyezés:",{"$nulls":7},"OTDK / TDK helyezés:",{"$nulls":7},"OTDK / TDK helyezés:",{"$nulls":7},"OTDK / TDK helyezés:",{"$nulls":7},"OTDK / TDK helyezés:",{"$nulls":7},"OTDK / TDK helyezés:",{"$nulls":7},"OTDK / TDK helyezés:",{"$nulls":7},"OTDK / TDK helyezés:",{"$nulls":7},"OTDK / TDK helyezés:",{"$nulls":7},"OTDK / TDK helyezés:",{"$nulls":7},"OTDK / TDK helyezés:",{"$nulls":7},"OTDK / TDK helyezés:",{"$nulls":7},"OTDK / TDK helyezés:",{"$nulls":7},"OTDK / TDK helyezés:",{"$nulls":7},"OTDK / TDK helyezés:",{"$nulls":7},"OTDK / TDK helyezés:",{"$nulls":7},"OTDK / TDK helyezés:",{"$nulls":7},"OTDK / TDK helyezés:",{"$nulls":7},"OTDK / TDK helyezés:",{"$nulls":7},"OTDK / TDK helyezés:",{"$nulls":7},"OTDK / TDK helyezés:",{"$nulls":7},"OTDK / TDK helyezés:",{"$nulls":7},"OTDK / TDK helyezés:",{"$nulls":7},"OTDK / TDK helyezés:",{"$nulls":7},"OTDK / TDK helyezés:",{"$nulls":7},"OTDK / TDK helyezés:",{"$nulls":7},"OTDK / TDK helyezés:",{"$nulls":7},"OTDK / TDK helyezés:",{"$nulls":7},"OTDK / TDK helyezés:",{"$nulls":7},"OTDK / TDK helyezés:",{"$nulls":7},"OTDK / TDK helyezés:",{"$nulls":7},"OTDK / TDK helyezés:",{"$nulls":7},"OTDK / TDK helyezés:",{"$nulls":7},"OTDK / TDK helyezés:",{"$nulls":7},"OTDK / TDK helyezés:",{"$nulls":7},"OTDK / TDK helyezés:",{"$nulls":7},"OTDK / TDK helyezés:",{"$nulls":7},"OTDK / TDK helyezés:",{"$nulls":7},"OTDK / TDK helyezés:",{"$nulls":7},"OTDK / TDK helyezés:",{"$nulls":7},"OTDK / TDK helyezés:",{"$nulls":7},"OTDK / TDK helyezés:",{"$nulls":7},"OTDK / TDK helyezés:",{"$nulls":7},"OTDK / TDK helyezés:",{"$nulls":7},"OTDK / TDK helyezés:",{"$nulls":7},"OTDK / TDK helyezés:",{"$nulls":7},"OTDK / TDK helyezés:",{"$nulls":7},"OTDK / TDK helyezés:",{"$nulls":7},"OTDK / TDK helyezés:",{"$nulls":7},"OTDK / TDK helyezés:",{"$nulls":7},"OTDK / TDK helyezés:",{"$nulls":7},"OTDK / TDK helyezés:",{"$nulls":7},"OTDK / TDK helyezés:",{"$nulls":7},"OTDK / TDK helyezés:",{"$nulls":7},"OTDK / TDK helyezés:",{"$nulls":7},"OTDK / TDK helyezés:",{"$nulls":7},"OTDK / TDK helyezés:",{"$nulls":7},"OTDK / TDK helyezés:",{"$nulls":7},"OTDK / TDK helyezés:",{"$nulls":7},"OTDK / TDK helyezés:",{"$nulls":7},"OTDK / TDK helyezés:",{"$nulls":7},"OTDK / TDK helyezés:",{"$nulls":7},"OTDK / TDK helyezés:",{"$nulls":7},"OTDK / TDK helyezés:",{"$nulls":7},"OTDK / TDK helyezés:",{"$nulls":7},"OTDK / TDK helyezés:",{"$nulls":7},"OTDK / TDK helyezés:",{"$nulls":7},"OTDK / TDK helyezés:",{"$nulls":7},"OTDK / TDK helyezés:",{"$nulls":7},"OTDK / TDK helyezés:",{"$nulls":7},"OTDK / TDK helyezés:",{"$nulls":7},"OTDK / TDK helyezés:",{"$nulls":7},"OTDK / TDK helyezés:",{"$nulls":7},"OTDK / TDK helyezés:",{"$nulls":7},"OTDK / TDK helyezés:",{"$nulls":7},"OTDK / TDK helyezés:",{"$nulls":7},"OTDK / TDK helyezés:",{"$nulls":7},"OTDK / TDK helyezés:",{"$nulls":7},"OTDK / TDK helyezés:",{"$nulls":7},"OTDK / TDK helyezés:",{"$nulls":7},"OTDK / TDK helyezés:",{"$nulls":7},"OTDK / TDK helyezés:",{"$nulls":7},"OTDK / TDK helyezés:",{"$nulls":7},"OTDK / TDK helyezés:",{"$nulls":7},"OTDK / TDK helyezés:",{"$nulls":7},"OTDK / TDK helyezés:",{"$nulls":7},"OTDK / TDK helyezés:",{"$nulls":7},"OTDK / TDK helyezés:",{"$nulls":7},"OTDK / TDK helyezés:",{"$nulls":7},"OTDK / TDK helyezés:",{"$nulls":7},"OTDK / TDK helyezés:",{"$nulls":7},"OTDK / TDK helyezés:",{"$nulls":7},"OTDK / TDK helyezés:",{"$nulls":7},"OTDK / TDK helyezés:",{"$nulls":7},"OTDK / TDK helyezés:",{"$nulls":7},"OTDK / TDK helyezés:",{"$nulls":7},"OTDK / TDK helyezés:",{"$nulls":7},"OTDK / TDK helyezés:",{"$nulls":7},"OTDK / TDK helyezés:",{"$nulls":7},"OTDK / TDK helyezés:",{"$nulls":7},"OTDK / TDK helyezés:",{"$nulls":7},"OTDK / TDK helyezés:",{"$nulls":7},"OTDK / TDK helyezés:",{"$nulls":7},"OTDK / TDK helyezés:",{"$nulls":7},"OTDK / TDK helyezés:",{"$nulls":7},"OTDK / TDK helyezés:",{"$nulls":7},"OTDK / TDK helyezés:",{"$nulls":7},"OTDK / TDK helyezés:",{"$nulls":7},"OTDK / TDK helyezés:",{"$nulls":7},"OTDK / TDK helyezés:",{"$nulls":7},"OTDK / TDK helyezés:",{"$nulls":7},"OTDK / TDK helyezés:",{"$nulls":7},"OTDK / TDK helyezés:",{"$nulls":7},"OTDK / TDK helyezés:",{"$nulls":7},"OTDK / TDK helyezés:",{"$nulls":7},"OTDK / TDK helyezés:",{"$nulls":7},"OTDK / TDK helyezés:",{"$nulls":7},"OTDK / TDK helyezés:",{"$nulls":7},"OTDK / TDK helyezés:",{"$nulls":7},"OTDK / TDK helyezés:",{"$nulls":7},"OTDK / TDK helyezés:",{"$nulls":7},"OTDK / TDK helyezés:",{"$nulls":7},"OTDK / TDK helyezés:",{"$nulls":7},"OTDK / TDK helyezés:",{"$nulls":7},"OTDK / TDK helyezés:",{"$nulls":7},"OTDK / TDK helyezés:",{"$nulls":7},"OTDK / TDK helyezés:",{"$nulls":7},"OTDK / TDK helyezés:",{"$nulls":7},"OTDK / TDK helyezés:",{"$nulls":7},"OTDK / TDK helyezés:",{"$nulls":7},"OTDK / TDK helyezés:",{"$nulls":7},"OTDK / TDK helyezés:",{"$nulls":7},"OTDK / TDK helyezés:",{"$nulls":7},"OTDK / TDK helyezés:",{"$nulls":7},"OTDK / TDK helyezés:",{"$nulls":7},"OTDK / TDK helyezés:",{"$nulls":7},"OTDK / TDK helyezés:",{"$nulls":7},"OTDK / TDK helyezés:",{"$nulls":7},"OTDK / TDK helyezés:",{"$nulls":7},"OTDK / TDK helyezés:",{"$nulls":7},"OTDK / TDK helyezés:",{"$nulls":7},"OTDK / TDK helyezés:",{"$nulls":7},"OTDK / TDK helyezés:",{"$nulls":7},"OTDK / TDK helyezés:",{"$nulls":7},"OTDK / TDK helyezés:",{"$nulls":7},"OTDK / TDK helyezés:",{"$nulls":7},"OTDK / TDK helyezés:",{"$nulls":7},"OTDK / TDK helyezés:",{"$nulls":7},"OTDK / TDK helyezés:",{"$nulls":7},"OTDK / TDK helyezés:",{"$nulls":7},"OTDK / TDK helyezés:",{"$nulls":7},"OTDK / TDK helyezés:",{"$nulls":7},"OTDK / TDK helyezés:",{"$nulls":7},"OTDK / TDK helyezés:",{"$nulls":7},"OTDK / TDK helyezés:",{"$nulls":7},"OTDK / TDK helyezés:",{"$nulls":7},"OTDK / TDK helyezés:",{"$nulls":7},"OTDK / TDK helyezés:",{"$nulls":7},"OTDK / TDK helyezés:",{"$nulls":7},"OTDK / TDK helyezés:",{"$nulls":7},"OTDK / TDK helyezés:",{"$nulls":7},"OTDK / TDK helyezés:",{"$nulls":7},"OTDK / TDK helyezés:",{"$nulls":7},"OTDK / TDK helyezés:",{"$nulls":7},"OTDK / TDK helyezés:",{"$nulls":7},"OTDK / TDK helyezés:",{"$nulls":7},"OTDK / TDK helyezés:",{"$nulls":7},"OTDK / TDK helyezés:",{"$nulls":7},"OTDK / TDK helyezés:",{"$nulls":7},"OTDK / TDK helyezés:",{"$nulls":7},"OTDK / TDK helyezés:",{"$nulls":7},"OTDK / TDK helyezés:",{"$nulls":7},"OTDK / TDK helyezés:",{"$nulls":7},"OTDK / TDK helyezés:",{"$nulls":7},"OTDK / TDK helyezés:",{"$nulls":7},"OTDK / TDK helyezés:",{"$nulls":7},"OTDK / TDK helyezés:",{"$nulls":7},"OTDK / TDK helyezés:",{"$nulls":7},"OTDK / TDK helyezés:",{"$nulls":7},"OTDK / TDK helyezés:",{"$nulls":7},"OTDK / TDK helyezés:",{"$nulls":7},"OTDK / TDK helyezés:",{"$nulls":7},"OTDK / TDK helyezés:",{"$nulls":7},"OTDK / TDK helyezés:",{"$nulls":7},"OTDK / TDK helyezés:",{"$nulls":7},"OTDK / TDK helyezés:",{"$nulls":7},"OTDK / TDK helyezés:",{"$nulls":7},"OTDK / TDK helyezés:",{"$nulls":7},"OTDK / TDK helyezés:",{"$nulls":7},"OTDK / TDK helyezés:",{"$nulls":7},"OTDK / TDK helyezés:",{"$nulls":7},"OTDK / TDK helyezés:",{"$nulls":7},"OTDK / TDK helyezés:",{"$nulls":7},"OTDK / TDK helyezés:",{"$nulls":7},"OTDK / TDK helyezés:",{"$nulls":7},"OTDK / TDK helyezés:",{"$nulls":7},"OTDK / TDK helyezés:",{"$nulls":7},"OTDK / TDK helyezés:",{"$nulls":7},"OTDK / TDK helyezés:",{"$nulls":7},"OTDK / TDK helyezés:",{"$nulls":7},"OTDK / TDK helyezés:",{"$nulls":7},"OTDK / TDK helyezés:",{"$nulls":7},"OTDK / TDK helyezés:",{"$nulls":7},"OTDK / TDK helyezés:",{"$nulls":7},"OTDK / TDK helyezés:",{"$nulls":7},"OTDK / TDK helyezés:",{"$nulls":7},"OTDK / TDK helyezés:",{"$nulls":7},"OTDK / TDK helyezés:",{"$nulls":7},"OTDK / TDK helyezés:",{"$nulls":7},"OTDK / TDK helyezés:",{"$nulls":7},"OTDK / TDK helyezés:",{"$nulls":7},"OTDK / TDK helyezés:",{"$nulls":7},"OTDK / TDK helyezés:",{"$nulls":7},"OTDK / TDK helyezés:",{"$nulls":7},"OTDK / TDK helyezés:",{"$nulls":7},"OTDK / TDK helyezés:",{"$nulls":7},"OTDK / TDK helyezés:",{"$nulls":7},"OTDK / TDK helyezés:",{"$nulls":7},"OTDK / TDK helyezés:",{"$nulls":7},"OTDK / TDK helyezés:",{"$nulls":7},"OTDK / TDK helyezés:",{"$nulls":7},"OTDK / TDK helyezés:",{"$nulls":7},"OTDK / TDK helyezés:",{"$nulls":7},"OTDK / TDK helyezés:",{"$nulls":7},"OTDK / TDK helyezés:",{"$nulls":7},"OTDK / TDK helyezés:",{"$nulls":7},"OTDK / TDK helyezés:",{"$nulls":7},"OTDK / TDK helyezés:",{"$nulls":7},"OTDK / TDK helyezés:",{"$nulls":7},"OTDK / TDK helyezés:",{"$nulls":7},"OTDK / TDK helyezés:",{"$nulls":7},"OTDK / TDK helyezés:",{"$nulls":7},"OTDK / TDK helyezés:",{"$nulls":7},"OTDK / TDK helyezés:",{"$nulls":7},"OTDK / TDK helyezés:",{"$nulls":7},"OTDK / TDK helyezés:",{"$nulls":7},"OTDK / TDK helyezés:",{"$nulls":7},"OTDK / TDK helyezés:",{"$nulls":7},"OTDK / TDK helyezés:",{"$nulls":7},"OTDK / TDK helyezés:",{"$nulls":7},"OTDK / TDK helyezés:",{"$nulls":7},"OTDK / TDK helyezés:",{"$nulls":7},"OTDK / TDK helyezés:",{"$nulls":7},"OTDK / TDK helyezés:",{"$nulls":7},"OTDK / TDK helyezés:",{"$nulls":7},"OTDK / TDK helyezés:",{"$nulls":7},"OTDK / TDK helyezés:",{"$nulls":7},"OTDK / TDK helyezés:",{"$nulls":7},"OTDK / TDK helyezés:",{"$nulls":7},"OTDK / TDK helyezés:",{"$nulls":7},"OTDK / TDK helyezés:",{"$nulls":7},"OTDK / TDK helyezés:",{"$nulls":7},"OTDK / TDK helyezés:",{"$nulls":7},"OTDK / TDK helyezés:",{"$nulls":7},"OTDK / TDK helyezés:",{"$nulls":7},"OTDK / TDK helyezés:",{"$nulls":7},"OTDK / TDK helyezés:",{"$nulls":7},"OTDK / TDK helyezés:",{"$nulls":7},"OTDK / TDK helyezés:",{"$nulls":7},"OTDK / TDK helyezés:",{"$nulls":7},"OTDK / TDK helyezés:",{"$nulls":7},"OTDK / TDK helyezés:",{"$nulls":7},"OTDK / TDK helyezés:",{"$nulls":7},"OTDK / TDK helyezés:",{"$nulls":7},"OTDK / TDK helyezés:",{"$nulls":7},"OTDK / TDK helyezés:",{"$nulls":7},"OTDK / TDK helyezés:",{"$nulls":7},"OTDK / TDK helyezés:",{"$nulls":7},"OTDK / TDK helyezés:",{"$nulls":7},"OTDK / TDK helyezés:",{"$nulls":7},"OTDK / TDK helyezés:",{"$nulls":7},"OTDK / TDK helyezés:",{"$nulls":7},"OTDK / TDK helyezés:",{"$nulls":7},"OTDK / TDK helyezés:",{"$nulls":7},"OTDK / TDK helyezés:",{"$nulls":7},"OTDK / TDK helyezés:",{"$nulls":7},"OTDK / TDK helyezés:",{"$nulls":7},"OTDK / TDK helyezés:",{"$nulls":7},"OTDK / TDK helyezés:",{"$nulls":7},"OTDK / TDK helyezés:",{"$nulls":7},"OTDK / TDK helyezés:",{"$nulls":7},"OTDK / TDK helyezés:",{"$nulls":7},"OTDK / TDK helyezés:",{"$nulls":7},"OTDK / TDK helyezés:",{"$nulls":7},"OTDK / TDK helyezés:",{"$nulls":7},"OTDK / TDK helyezés:",{"$nulls":7},"OTDK / TDK helyezés:",{"$nulls":7},"OTDK / TDK helyezés:",{"$nulls":7},"OTDK / TDK helyezés:",{"$nulls":7},"OTDK / TDK helyezés:",{"$nulls":7},"OTDK / TDK helyezés:",{"$nulls":7},"OTDK / TDK helyezés:",{"$nulls":7},"OTDK / TDK helyezés:",{"$nulls":7},"OTDK / TDK helyezés:",{"$nulls":7},"OTDK / TDK helyezés:",{"$nulls":7},"OTDK / TDK helyezés:",{"$nulls":7},"OTDK / TDK helyezés:",{"$nulls":7},"OTDK / TDK helyezés:",{"$nulls":7},"OTDK / TDK helyezés:",{"$nulls":7},"OTDK / TDK helyezés:",{"$nulls":7},"OTDK / TDK helyezés:",{"$nulls":7},"OTDK / TDK helyezés:",{"$nulls":7},"OTDK / TDK helyezés:",{"$nulls":7},"OTDK / TDK helyezés:",{"$nulls":7},"OTDK / TDK helyezés:",{"$nulls":7},"OTDK / TDK helyezés:",{"$nulls":7},"OTDK / TDK helyezés:",{"$nulls":7},"OTDK / TDK helyezés:",{"$nulls":7},"OTDK / TDK helyezés:",{"$nulls":7},"OTDK / TDK helyezés:",{"$nulls":7},"OTDK / TDK helyezés:",{"$nulls":7},"OTDK / TDK helyezés:",{"$nulls":7},"OTDK / TDK helyezés:",{"$nulls":7},"OTDK / TDK helyezés:",{"$nulls":7},"OTDK / TDK helyezés:",{"$nulls":7},"OTDK / TDK helyezés:",{"$nulls":7},"OTDK / TDK helyezés:",{"$nulls":7},"OTDK / TDK helyezés:",{"$nulls":7},"OTDK / TDK helyezés:",{"$nulls":7},"OTDK / TDK helyezés:",{"$nulls":7},"OTDK / TDK helyezés:",{"$nulls":7},"OTDK / TDK helyezés:",{"$nulls":7},"OTDK / TDK helyezés:",{"$nulls":7},"OTDK / TDK helyezés:",{"$nulls":7},"OTDK / TDK helyezés:",{"$nulls":7},"OTDK / TDK helyezés:",{"$nulls":7},"OTDK / TDK helyezés:",{"$nulls":7},"OTDK / TDK helyezés:",{"$nulls":7},"OTDK / TDK helyezés:",{"$nulls":7},"OTDK / TDK helyezés:",{"$nulls":7},"OTDK / TDK helyezés:",{"$nulls":7},"OTDK / TDK helyezés:",{"$nulls":7},"OTDK / TDK helyezés:",{"$nulls":7},"OTDK / TDK helyezés:",{"$nulls":7},"OTDK / TDK helyezés:",{"$nulls":7},"OTDK / TDK helyezés:",{"$nulls":7},"OTDK / TDK helyezés:",{"$nulls":7},"OTDK / TDK helyezés:",{"$nulls":7},"OTDK / TDK helyezés:",{"$nulls":7},"OTDK / TDK helyezés:",{"$nulls":7},"OTDK / TDK helyezés:",{"$nulls":7},"OTDK / TDK helyezés:",{"$nulls":7},"OTDK / TDK helyezés:",{"$nulls":7},"OTDK / TDK helyezés:",{"$nulls":7},"OTDK / TDK helyezés:",{"$nulls":7},"OTDK / TDK helyezés:",{"$nulls":7},"OTDK / TDK helyezés:",{"$nulls":7},"OTDK / TDK helyezés:",{"$nulls":7},"OTDK / TDK helyezés:",{"$nulls":7},"OTDK / TDK helyezés:",{"$nulls":7},"OTDK / TDK helyezés:",{"$nulls":7},"OTDK / TDK helyezés:",{"$nulls":7},"OTDK / TDK helyezés:",{"$nulls":7},"OTDK / TDK helyezés:",{"$nulls":7},"OTDK / TDK helyezés:",{"$nulls":7},"OTDK / TDK helyezés:",{"$nulls":7},"OTDK / TDK helyezés:",{"$nulls":7},"OTDK / TDK helyezés:",{"$nulls":7},"OTDK / TDK helyezés:",{"$nulls":7},"OTDK / TDK helyezés:",{"$nulls":7},"OTDK / TDK helyezés:",{"$nulls":7},"OTDK / TDK helyezés:",{"$nulls":7},"OTDK / TDK helyezés:",{"$nulls":7},"OTDK / TDK helyezés:",{"$nulls":7},"OTDK / TDK helyezés:",{"$nulls":7},"OTDK / TDK helyezés:",{"$nulls":7},"OTDK / TDK helyezés:",{"$nulls":7},"OTDK / TDK helyezés:",{"$nulls":7},"OTDK / TDK helyezés:",{"$nulls":7},"OTDK / TDK helyezés:",{"$nulls":7},"OTDK / TDK helyezés:",{"$nulls":7},"OTDK / TDK helyezés:",{"$nulls":7},"OTDK / TDK helyezés:",{"$nulls":7},"OTDK / TDK helyezés:",{"$nulls":7},"OTDK / TDK helyezés:",{"$nulls":7},"OTDK / TDK helyezés:",{"$nulls":7},"OTDK / TDK helyezés:",{"$nulls":7},"OTDK / TDK helyezés:",{"$nulls":7},"OTDK / TDK helyezés:",{"$nulls":7},"OTDK / TDK helyezés:",{"$nulls":7},"OTDK / TDK helyezés:",{"$nulls":7},"OTDK / TDK helyezés:",{"$nulls":7},"OTDK / TDK helyezés:",{"$nulls":7},"OTDK / TDK helyezés:",{"$nulls":7},"OTDK / TDK helyezés:",{"$nulls":7},"OTDK / TDK helyezés:",{"$nulls":7},"OTDK / TDK helyezés:",{"$nulls":7},"OTDK / TDK helyezés:",{"$nulls":7},"OTDK / TDK helyezés:",{"$nulls":7},"OTDK / TDK helyezés:",{"$nulls":7},"OTDK / TDK helyezés:",{"$nulls":7},"OTDK / TDK helyezés:",{"$nulls":7},"OTDK / TDK helyezés:",{"$nulls":7},"OTDK / TDK helyezés:",{"$nulls":7},"OTDK / TDK helyezés:",{"$nulls":7},"OTDK / TDK helyezés:",{"$nulls":7},"OTDK / TDK helyezés:",{"$nulls":7},"OTDK / TDK helyezés:",{"$nulls":7},"OTDK / TDK helyezés:",{"$nulls":7},"OTDK / TDK helyezés:",{"$nulls":7},"OTDK / TDK helyezés:",{"$nulls":7},"OTDK / TDK helyezés:",{"$nulls":7},"OTDK / TDK helyezés:",{"$nulls":7},"OTDK / TDK helyezés:",{"$nulls":7},"OTDK / TDK helyezés:",{"$nulls":7},"OTDK / TDK helyezés:",{"$nulls":7},"OTDK / TDK helyezés:",{"$nulls":7},"OTDK / TDK helyezés:",{"$nulls":7},"OTDK / TDK helyezés:",{"$nulls":7},"OTDK / TDK helyezés:",{"$nulls":7},"OTDK / TDK helyezés:",{"$nulls":7},"OTDK / TDK helyezés:",{"$nulls":7},"OTDK / TDK helyezés:",{"$nulls":7},"OTDK / TDK helyezés:",{"$nulls":7},"OTDK / TDK helyezés:",{"$nulls":7},"OTDK / TDK helyezés:",{"$nulls":7},"OTDK / TDK helyezés:",{"$nulls":7},"OTDK / TDK helyezés:",{"$nulls":7},"OTDK / TDK helyezés:",{"$nulls":7},"OTDK / TDK helyezés:",{"$nulls":7},"OTDK / TDK helyezés:",{"$nulls":7},"OTDK / TDK helyezés:",{"$nulls":7},"OTDK / TDK helyezés:",{"$nulls":7},"OTDK / TDK helyezés:",{"$nulls":7},"OTDK / TDK helyezés:",{"$nulls":7},"OTDK / TDK helyezés:",{"$nulls":7},"OTDK / TDK helyezés:",{"$nulls":7},"OTDK / TDK helyezés:",{"$nulls":7},"OTDK / TDK helyezés:",{"$nulls":7},"OTDK / TDK helyezés:",{"$nulls":7},"OTDK / TDK helyezés:",{"$nulls":7},"OTDK / TDK helyezés:",{"$nulls":7},"OTDK / TDK helyezés:",{"$nulls":7},"OTDK / TDK helyezés:",{"$nulls":7},"OTDK / TDK helyezés:",{"$nulls":7},"OTDK / TDK helyezés:",{"$nulls":7},"OTDK / TDK helyezés:",{"$nulls":7},"OTDK / TDK helyezés:",{"$nulls":7},"OTDK / TDK helyezés:",{"$nulls":7},"OTDK / TDK helyezés:",{"$nulls":7},"OTDK / TDK helyezés:",{"$nulls":7},"OTDK / TDK helyezés:",{"$nulls":7},"OTDK / TDK helyezés:",{"$nulls":7},"OTDK / TDK helyezés:",{"$nulls":7},"OTDK / TDK helyezés:",{"$nulls":7},"OTDK / TDK helyezés:",{"$nulls":7},"OTDK / TDK helyezés:",{"$nulls":7},"OTDK / TDK helyezés:",{"$nulls":7},"OTDK / TDK helyezés:",{"$nulls":7},"OTDK / TDK helyezés:",{"$nulls":7},"OTDK / TDK helyezés:",{"$nulls":7},"OTDK / TDK helyezés:",{"$nulls":7},"OTDK / TDK helyezés:",{"$nulls":7},"OTDK / TDK helyezés:",{"$nulls":7},"OTDK / TDK helyezés:",{"$nulls":7},"OTDK / TDK helyezés:",{"$nulls":7},"OTDK / TDK helyezés:",{"$nulls":7},"OTDK / TDK helyezés:",{"$nulls":7},"OTDK / TDK helyezés:",{"$nulls":7},"OTDK / TDK helyezés:",{"$nulls":7},"OTDK / TDK helyezés:",{"$nulls":7},"OTDK / TDK helyezés:",{"$nulls":7},"OTDK / TDK helyezés:",{"$nulls":7},"OTDK / TDK helyezés:",{"$nulls":7},"OTDK / TDK helyezés:",{"$nulls":7},"OTDK / TDK helyezés:",{"$nulls":7},"OTDK / TDK helyezés:",{"$nulls":7},"OTDK / TDK helyezés:",{"$nulls":7},"OTDK / TDK helyezés:",{"$nulls":7},"OTDK / TDK helyezés:",{"$nulls":7},"OTDK / TDK helyezés:",{"$nulls":7},"OTDK / TDK helyezés:",{"$nulls":7},"OTDK / TDK helyezés:",{"$nulls":7},"OTDK / TDK helyezés:",{"$nulls":7},"OTDK / TDK helyezés:",{"$nulls":7},"OTDK / TDK helyezés:",{"$nulls":7},"OTDK / TDK helyezés:",{"$nulls":7},"OTDK / TDK helyezés:",{"$nulls":7},"OTDK / TDK helyezés:",{"$nulls":7},"OTDK / TDK helyezés:",{"$nulls":7},"OTDK / TDK helyezés:",{"$nulls":7},"OTDK / TDK helyezés:",{"$nulls":7},"OTDK / TDK helyezés:",{"$nulls":7},"OTDK / TDK helyezés:",{"$nulls":7},"OTDK / TDK helyezés:",{"$nulls":7},"OTDK / TDK helyezés:",{"$nulls":7},"OTDK / TDK helyezés:",{"$nulls":7},"OTDK / TDK helyezés:",{"$nulls":7},"OTDK / TDK helyezés:",{"$nulls":7},"OTDK / TDK helyezés:",{"$nulls":7},"OTDK / TDK helyezés:",{"$nulls":7},"OTDK / TDK helyezés:",{"$nulls":7},"OTDK / TDK helyezés:",{"$nulls":7},"OTDK / TDK helyezés:",{"$nulls":7},"OTDK / TDK helyezés:",{"$nulls":7},"OTDK / TDK helyezés:",{"$nulls":7},"OTDK / TDK helyezés:",{"$nulls":7},"OTDK / TDK helyezés:",{"$nulls":7},"OTDK / TDK helyezés:",{"$nulls":7},"OTDK / TDK helyezés:",{"$nulls":7},"OTDK / TDK helyezés:",{"$nulls":7},"OTDK / TDK helyezés:",{"$nulls":7},"OTDK / TDK helyezés:",{"$nulls":7},"OTDK / TDK helyezés:",{"$nulls":7},"OTDK / TDK helyezés:",{"$nulls":7},"OTDK / TDK helyezés:",{"$nulls":7},"OTDK / TDK helyezés:",{"$nulls":7},"OTDK / TDK helyezés:",{"$nulls":7},"OTDK / TDK helyezés:",{"$nulls":7},"OTDK / TDK helyezés:",{"$nulls":7},"OTDK / TDK helyezés:",{"$nulls":7},"OTDK / TDK helyezés:",{"$nulls":7},"OTDK / TDK helyezés:",{"$nulls":7},"OTDK / TDK helyezés:",{"$nulls":7},"OTDK / TDK helyezés:",{"$nulls":7},"OTDK / TDK helyezés:",{"$nulls":7},"OTDK / TDK helyezés:",{"$nulls":7},"OTDK / TDK helyezés:",{"$nulls":7},"OTDK / TDK helyezés:",{"$nulls":7},"OTDK / TDK helyezés:",{"$nulls":7},"OTDK / TDK helyezés:",{"$nulls":7},"OTDK / TDK helyezés:",{"$nulls":7},"OTDK / TDK helyezés:",{"$nulls":7},"OTDK / TDK helyezés:",{"$nulls":7},"OTDK / TDK helyezés:",{"$nulls":7},"OTDK / TDK helyezés:",{"$nulls":7},"OTDK / TDK helyezés:",{"$nulls":7},"OTDK / TDK helyezés:",{"$nulls":7},"OTDK / TDK helyezés:",{"$nulls":7},"OTDK / TDK helyezés:",{"$nulls":7},"OTDK / TDK helyezés:",{"$nulls":7},"OTDK / TDK helyezés:",{"$nulls":7},"OTDK / TDK helyezés:",{"$nulls":7},"OTDK / TDK helyezés:",{"$nulls":7},"OTDK / TDK helyezés:",{"$nulls":7},"OTDK / TDK helyezés:",{"$nulls":7},"OTDK / TDK helyezés:",{"$nulls":7},"OTDK / TDK helyezés:",{"$nulls":7},"OTDK / TDK helyezés:",{"$nulls":7},"OTDK / TDK helyezés:",{"$nulls":7},"OTDK / TDK helyezés:",{"$nulls":7},"OTDK / TDK helyezés:",{"$nulls":7},"OTDK / TDK helyezés:",{"$nulls":7},"OTDK / TDK helyezés:",{"$nulls":7},"OTDK / TDK helyezés:",{"$nulls":7},"OTDK / TDK helyezés:",{"$nulls":7},"OTDK / TDK helyezés:",{"$nulls":7},"OTDK / TDK helyezés:",{"$nulls":7},"OTDK / TDK helyezés:",{"$nulls":7},"OTDK / TDK helyezés:",{"$nulls":7},"OTDK / TDK helyezés:",{"$nulls":7},"OTDK / TDK helyezés:",{"$nulls":7},"OTDK / TDK helyezés:",{"$nulls":7},"OTDK / TDK helyezés:",{"$nulls":7},"OTDK / TDK helyezés:",{"$nulls":7},"OTDK / TDK helyezés:",{"$nulls":7},"OTDK / TDK helyezés:",{"$nulls":7},"OTDK / TDK helyezés:",{"$nulls":7},"OTDK / TDK helyezés:",{"$nulls":7},"OTDK / TDK helyezés:",{"$nulls":7},"OTDK / TDK helyezés:",{"$nulls":7},"OTDK / TDK helyezés:",{"$nulls":7},"OTDK / TDK helyezés:",{"$nulls":7},"OTDK / TDK helyezés:",{"$nulls":7},"OTDK / TDK helyezés:",{"$nulls":7},"OTDK / TDK helyezés:",{"$nulls":7},"OTDK / TDK helyezés:",{"$nulls":7},"OTDK / TDK helyezés:",{"$nulls":7},"OTDK / TDK helyezés:",{"$nulls":7},"OTDK / TDK helyezés:",{"$nulls":7},"OTDK / TDK helyezés:",{"$nulls":7},"OTDK / TDK helyezés:",{"$nulls":7},"OTDK / TDK helyezés:",{"$nulls":7},"OTDK / TDK helyezés:",{"$nulls":7},"OTDK / TDK helyezés:",{"$nulls":7},"OTDK / TDK helyezés:",{"$nulls":7},"OTDK / TDK helyezés:",{"$nulls":7},"OTDK / TDK helyezés:",{"$nulls":7},"OTDK / TDK helyezés:",{"$nulls":7},"OTDK / TDK helyezés:",{"$nulls":7},"OTDK / TDK helyezés:",{"$nulls":7},"OTDK / TDK helyezés:",{"$nulls":7},"OTDK / TDK helyezés:",{"$nulls":7},"OTDK / TDK helyezés:",{"$nulls":7},"OTDK / TDK helyezés:",{"$nulls":7},"OTDK / TDK helyezés:",{"$nulls":7},"OTDK / TDK helyezés:",{"$nulls":7},"OTDK / TDK helyezés:",{"$nulls":7},"OTDK / TDK helyezés:",{"$nulls":7},"OTDK / TDK helyezés:",{"$nulls":7},"OTDK / TDK helyezés:",{"$nulls":7},"OTDK / TDK helyezés:",{"$nulls":7},"OTDK / TDK helyezés:",{"$nulls":7},"OTDK / TDK helyezés:",{"$nulls":7},"OTDK / TDK helyezés:",{"$nulls":7},"OTDK / TDK helyezés:",{"$nulls":7},"OTDK / TDK helyezés:",{"$nulls":7},"OTDK / TDK helyezés:",{"$nulls":7},"OTDK / TDK helyezés:",{"$nulls":7},"OTDK / TDK helyezés:",{"$nulls":7},"OTDK / TDK helyezés:",{"$nulls":7},"OTDK / TDK helyezés:",{"$nulls":7},"OTDK / TDK helyezés:",{"$nulls":7},"OTDK / TDK helyezés:",{"$nulls":7},"OTDK / TDK helyezés:",{"$nulls":7},"OTDK / TDK helyezés:",{"$nulls":7},"OTDK / TDK helyezés:",{"$nulls":7},"OTDK / TDK helyezés:",{"$nulls":7},"OTDK / TDK helyezés:",{"$nulls":7},"OTDK / TDK helyezés:",{"$nulls":7},"OTDK / TDK helyezés:",{"$nulls":7},"OTDK / TDK helyezés:",{"$nulls":7},"OTDK / TDK helyezés:",{"$nulls":7},"OTDK / TDK helyezés:",{"$nulls":7},"OTDK / TDK helyezés:",{"$nulls":7},"OTDK / TDK helyezés:",{"$nulls":7},"OTDK / TDK helyezés:",{"$nulls":7},"OTDK / TDK helyezés:",{"$nulls":7},"OTDK / TDK helyezés:",{"$nulls":7},"OTDK / TDK helyezés:",{"$nulls":7},"OTDK / TDK helyezés:",{"$nulls":7},"OTDK / TDK helyezés:",{"$nulls":7},"OTDK / TDK helyezés:",{"$nulls":7},"OTDK / TDK helyezés:",{"$nulls":7},"OTDK / TDK helyezés:",{"$nulls":7},"OTDK / TDK helyezés:",{"$nulls":7},"OTDK / TDK helyezés:",{"$nulls":7},"OTDK / TDK helyezés:",{"$nulls":7},"OTDK / TDK helyezés:",{"$nulls":7},"OTDK / TDK helyezés:",{"$nulls":7},"OTDK / TDK helyezés:",{"$nulls":7},"OTDK / TDK helyezés:",{"$nulls":7},"OTDK / TDK helyezés:",{"$nulls":7},"OTDK / TDK helyezés:",{"$nulls":7},"OTDK / TDK helyezés:",{"$nulls":7},"OTDK / TDK helyezés:",{"$nulls":7},"OTDK / TDK helyezés:",{"$nulls":7},"OTDK / TDK helyezés:",{"$nulls":7},"OTDK / TDK helyezés:",{"$nulls":7},"OTDK / TDK helyezés:",{"$nulls":7},"OTDK / TDK helyezés:",{"$nulls":7},"OTDK / TDK helyezés:",{"$nulls":7},"OTDK / TDK helyezés:",{"$nulls":7},"OTDK / TDK helyezés:",{"$nulls":7},"OTDK / TDK helyezés:",{"$nulls":7},"OTDK / TDK helyezés:",{"$nulls":7},"OTDK / TDK helyezés:",{"$nulls":7},"OTDK / TDK helyezés:",{"$nulls":7},"OTDK / TDK helyezés:",{"$nulls":7},"OTDK / TDK helyezés:",{"$nulls":7},"OTDK / TDK helyezés:",{"$nulls":7},"OTDK / TDK helyezés:",{"$nulls":7},"OTDK / TDK helyezés:",{"$nulls":7},"OTDK / TDK helyezés:",{"$nulls":7},"OTDK / TDK helyezés:",{"$nulls":7},"OTDK / TDK helyezés:",{"$nulls":7},"OTDK / TDK helyezés:",{"$nulls":7},"OTDK / TDK helyezés:",{"$nulls":7},"OTDK / TDK helyezés:",{"$nulls":7},"OTDK / TDK helyezés:",{"$nulls":7},"OTDK / TDK helyezés:",{"$nulls":7},"OTDK / TDK helyezés:",{"$nulls":7},"OTDK / TDK helyezés:",{"$nulls":7},"OTDK / TDK helyezés:",{"$nulls":7},"OTDK / TDK helyezés:",{"$nulls":7},"OTDK / TDK helyezés:",{"$nulls":7},"OTDK / TDK helyezés:",{"$nulls":7},"OTDK / TDK helyezés:",{"$nulls":7},"OTDK / TDK helyezés:",{"$nulls":7},"OTDK / TDK helyezés:",{"$nulls":7},"OTDK / TDK helyezés:",{"$nulls":7},"OTDK / TDK helyezés:",{"$nulls":7},"OTDK / TDK helyezés:",{"$nulls":7},"OTDK / TDK helyezés:",{"$nulls":7},"OTDK / TDK helyezés:",{"$nulls":7},"OTDK / TDK helyezés:",{"$nulls":7},"OTDK / TDK helyezés:",{"$nulls":7},"OTDK / TDK helyezés:",{"$nulls":7},"OTDK / TDK helyezés:",{"$nulls":7},"OTDK / TDK helyezés:",{"$nulls":7},"OTDK / TDK helyezés:",{"$nulls":7},"OTDK / TDK helyezés:",{"$nulls":7},"OTDK / TDK helyezés:",{"$nulls":7},"OTDK / TDK helyezés:",{"$nulls":7},"OTDK / TDK helyezés:",{"$nulls":7},"OTDK / TDK helyezés:",{"$nulls":7},"OTDK / TDK helyezés:",{"$nulls":7},"OTDK / TDK helyezés:",{"$nulls":7},"OTDK / TDK helyezés:",{"$nulls":7},"OTDK / TDK helyezés:",{"$nulls":7},"OTDK / TDK helyezés:",{"$nulls":7},"OTDK / TDK helyezés:",{"$nulls":7},"OTDK / TDK helyezés:",{"$nulls":7},"OTDK / TDK helyezés:",{"$nulls":7},"OTDK / TDK helyezés:",{"$nulls":7},"OTDK / TDK helyezés:",{"$nulls":7},"OTDK / TDK helyezés:",{"$nulls":7},"OTDK / TDK helyezés:",{"$nulls":7},"OTDK / TDK helyezés:",{"$nulls":7},"OTDK / TDK helyezés:",{"$nulls":7},"OTDK / TDK helyezés:",{"$nulls":7},"OTDK / TDK helyezés:",{"$nulls":7},"OTDK / TDK helyezés:",{"$nulls":7},"OTDK / TDK helyezés:",{"$nulls":7},"OTDK / TDK helyezés:",{"$nulls":7},"OTDK / TDK helyezés:",{"$nulls":7},"OTDK / TDK helyezés:",{"$nulls":7},"OTDK / TDK helyezés:",{"$nulls":7},"OTDK / TDK helyezés:",{"$nulls":7},"OTDK / TDK helyezés:",{"$nulls":7},"OTDK / TDK helyezés:",{"$nulls":7},"OTDK / TDK helyezés:",{"$nulls":7},"OTDK / TDK helyezés:",{"$nulls":7},"OTDK / TDK helyezés:",{"$nulls":7},"OTDK / TDK helyezés:",{"$nulls":7},"OTDK / TDK helyezés:",{"$nulls":7},"OTDK / TDK helyezés:",{"$nulls":7},"OTDK / TDK helyezés:",{"$nulls":7},"OTDK / TDK helyezés:",{"$nulls":7},"OTDK / TDK helyezés:",{"$nulls":7},"OTDK / TDK helyezés:",{"$nulls":7},"OTDK / TDK helyezés:",{"$nulls":7},"OTDK / TDK helyezés:",{"$nulls":7},"OTDK / TDK helyezés:",{"$nulls":7},"OTDK / TDK helyezés:",{"$nulls":7},"OTDK / TDK helyezés:",{"$nulls":7},"OTDK / TDK helyezés:",{"$nulls":7},"OTDK / TDK helyezés:",{"$nulls":7},"OTDK / TDK helyezés:",{"$nulls":7},"OTDK / TDK helyezés:",{"$nulls":7},"OTDK / TDK helyezés:",{"$nulls":7},"OTDK / TDK helyezés:",{"$nulls":7},"OTDK / TDK helyezés:",{"$nulls":7},"OTDK / TDK helyezés:",{"$nulls":7},"OTDK / TDK helyezés:",{"$nulls":7},"OTDK / TDK helyezés:",{"$nulls":7},"OTDK / TDK helyezés:",{"$nulls":7},"OTDK / TDK helyezés:",{"$nulls":7},"OTDK / TDK helyezés:",{"$nulls":7},"OTDK / TDK helyezés:",{"$nulls":7},"OTDK / TDK helyezés:",{"$nulls":7},"OTDK / TDK helyezés:",{"$nulls":7},"OTDK / TDK helyezés:",{"$nulls":7},"OTDK / TDK helyezés:",{"$nulls":7},"OTDK / TDK helyezés:",{"$nulls":7},"OTDK / TDK helyezés:",{"$nulls":7},"OTDK / TDK helyezés:",{"$nulls":7},"OTDK / TDK helyezés:",{"$nulls":7},"OTDK / TDK helyezés:",{"$nulls":7},"OTDK / TDK helyezés:",{"$nulls":7},"OTDK / TDK helyezés:",{"$nulls":7},"OTDK / TDK helyezés:",{"$nulls":7},"OTDK / TDK helyezés:",{"$nulls":7},"OTDK / TDK helyezés:",{"$nulls":7},"OTDK / TDK helyezés:",{"$nulls":7},"OTDK / TDK helyezés:",{"$nulls":7},"OTDK / TDK helyezés:",{"$nulls":7},"OTDK / TDK helyezés:",{"$nulls":7},"OTDK / TDK helyezés:",{"$nulls":7},"OTDK / TDK helyezés:",{"$nulls":7},"OTDK / TDK helyezés:",{"$nulls":7},"OTDK / TDK helyezés:",{"$nulls":7},"OTDK / TDK helyezés:",{"$nulls":7},"OTDK / TDK helyezés:",{"$nulls":7},"OTDK / TDK helyezés:",{"$nulls":7},"OTDK / TDK helyezés:",{"$nulls":7},"OTDK / TDK helyezés:",{"$nulls":7},"OTDK / TDK helyezés:",{"$nulls":7},"OTDK / TDK helyezés:",{"$nulls":7},"OTDK / TDK helyezés:",{"$nulls":7},"OTDK / TDK helyezés:",{"$nulls":7},"OTDK / TDK helyezés:",{"$nulls":7},"OTDK / TDK helyezés:",{"$nulls":7},"OTDK / TDK helyezés:",{"$nulls":7},"OTDK / TDK helyezés:",{"$nulls":7},"OTDK / TDK helyezés:",{"$nulls":7},"OTDK / TDK helyezés:",{"$nulls":7},"OTDK / TDK helyezés:",{"$nulls":7},"OTDK / TDK helyezés:",{"$nulls":7},"OTDK / TDK helyezés:",{"$nulls":7},"OTDK / TDK helyezés:",{"$nulls":7},"OTDK / TDK helyezés:",{"$nulls":7},"OTDK / TDK helyezés:",{"$nulls":7},"OTDK / TDK helyezés:",{"$nulls":7},"OTDK / TDK helyezés:",{"$nulls":7},"OTDK / TDK helyezés:",{"$nulls":7},"OTDK / TDK helyezés:",{"$nulls":7},"OTDK / TDK helyezés:",{"$nulls":7},"OTDK / TDK helyezés:",{"$nulls":7},"OTDK / TDK helyezés:",{"$nulls":7},"OTDK / TDK helyezés:",{"$nulls":7},"OTDK / TDK helyezés:",{"$nulls":7},"OTDK / TDK helyezés:",{"$nulls":7},"OTDK / TDK helyezés:",{"$nulls":7},"OTDK / TDK helyezés:",{"$nulls":7},"OTDK / TDK helyezés:",{"$nulls":7},"OTDK / TDK helyezés:",{"$nulls":7},"OTDK / TDK helyezés:",{"$nulls":7},"OTDK / TDK helyezés:",{"$nulls":7},"OTDK / TDK helyezés:",{"$nulls":7},"OTDK / TDK helyezés:",{"$nulls":7},"OTDK / TDK helyezés:",{"$nulls":7},"OTDK / TDK helyezés:",{"$nulls":7},"OTDK / TDK helyezés:",{"$nulls":7},"OTDK / TDK helyezés:",{"$nulls":7},"OTDK / TDK helyezés:",{"$nulls":7},"OTDK / TDK helyezés:",{"$nulls":7},"OTDK / TDK helyezés:",{"$nulls":7},"OTDK / TDK helyezés:",{"$nulls":7},"OTDK / TDK helyezés:",{"$nulls":7},"OTDK / TDK helyezés:",{"$nulls":7},"OTDK / TDK helyezés:",{"$nulls":7},"OTDK / TDK helyezés:",{"$nulls":7},"OTDK / TDK helyezés:",{"$nulls":7},"OTDK / TDK helyezés:",{"$nulls":7},"OTDK / TDK helyezés:",{"$nulls":7},"OTDK / TDK helyezés:",{"$nulls":7},"OTDK / TDK helyezés:",{"$nulls":7},"OTDK / TDK helyezés:",{"$nulls":7},"OTDK / TDK helyezés:",{"$nulls":7},"OTDK / TDK helyezés:",{"$nulls":7},"OTDK / TDK helyezés:",{"$nulls":7},"OTDK / TDK helyezés:",{"$nulls":7},"OTDK / TDK helyezés:",{"$nulls":7},"OTDK / TDK helyezés:",{"$nulls":7},"OTDK / TDK helyezés:",{"$nulls":7},"OTDK / TDK helyezés:",{"$nulls":7},"OTDK / TDK helyezés:",{"$nulls":7},"OTDK / TDK helyezés:",{"$nulls":7},"OTDK / TDK helyezés:",{"$nulls":7},"OTDK / TDK helyezés:",{"$nulls":7},"OTDK / TDK helyezés:",{"$nulls":7},"OTDK / TDK helyezés:",{"$nulls":7},"OTDK / TDK helyezés:",{"$nulls":7},"OTDK / TDK helyezés:",{"$nulls":7},"OTDK / TDK helyezés:",{"$nulls":7},"OTDK / TDK helyezés:",{"$nulls":7},"OTDK / TDK helyezés:",{"$nulls":7},"OTDK / TDK helyezés:",{"$nulls":7},"OTDK / TDK helyezés:",{"$nulls":7},"OTDK / TDK helyezés:",{"$nulls":7},"OTDK / TDK helyezés:",{"$nulls":7},"OTDK / TDK helyezés:",{"$nulls":7},"OTDK / TDK helyezés:",{"$nulls":7},"OTDK / TDK helyezés:",{"$nulls":7},"OTDK / TDK helyezés:",{"$nulls":7},"OTDK / TDK helyezés:",{"$nulls":7},"OTDK / TDK helyezés:",{"$nulls":7},"OTDK / TDK helyezés:",{"$nulls":7},"OTDK / TDK helyezés:",{"$nulls":7},"OTDK / TDK helyezés:",{"$nulls":7},"OTDK / TDK helyezés:",{"$nulls":7},"OTDK / TDK helyezés:",{"$nulls":7},"OTDK / TDK helyezés:",{"$nulls":7},"OTDK / TDK helyezés:",{"$nulls":7},"OTDK / TDK helyezés:"]
[]
[]
[null,null,null,"Tervezett mobilitás adatai:"]
[null,null,null,"Első helyre sorolt mobilitás"]
[]
[{"$f":"IF(E6=\"szakmai gyakorlat\",\"Fogadó intézmény/vállalkozás:\",\"Fogadó intézmény:\")","v":"Fogadó intézmény:"},{"$nulls":7},"Kar vagy tanszék:"]
[]
["Ország:",{"$nulls":7},"Város:"]
[]
["Cím:",{"$nulls":7},"ERASMUS-kód:"]
[]
["Weboldal:",{"$nulls":7},{"$f":"IF(E6=\"szakmai gyakorlat\",\"Munkavégzés nyelve:\",\"Oktatás nyelve:\")","v":"Oktatás nyelve:"}]
[]
["Partner kapcsolattartójának neve:",{"$nulls":7},"Pozíciója:"]
[]
["E-mail cím:",{"$nulls":7},"Telefonszám:"]
[]
["Mobilitás kezdete:",{"$nulls":7},"Mobilitás vége:"]
[]
[]
[null,null,null,"Tervezett mobilitás adatai:",{"$f":"IF(E6<>\"hallgatói (kredit-)mobilitás\",\"Csak hallgatói (kredit-)mobilitás pályázat esetén!\",\"\")","v":"Csak hallgatói (kredit-)mobilitás pályázat esetén!"}]
[null,null,null,"Második helyre sorolt mobilitás"]
[]
["Fogadó intézmény:",{"$nulls":7},"Kar vagy tanszék:"]
[]
["Ország:",{"$nulls":7},"Város:"]
[]
["Cím:",{"$nulls":7},"ERASMUS-kód:"]
[]
["Weboldal:",{"$nulls":7},{"$f":"IF(E6=\"szakmai gyakorlat\",\"Munkavégzés nyelve:\",\"Oktatás nyelve:\")","v":"Oktatás nyelve:"}]
[]
["Partner kapcsolattartójának neve:",{"$nulls":7},"Pozíciója:"]
[]
["E-mail cím:",{"$nulls":7},"Telefonszám:"]
[]
["Mobilitás kezdete:",{"$nulls":7},"Mobilitás vége:"]
[]
[]
[null,null,null,"Tervezett mobilitás adatai:",{"$f":"IF(E6<>\"hallgatói (kredit-)mobilitás\",\"Csak hallgatói (kredit-)mobilitás pályázat esetén!\",\"\")","v":"Csak hallgatói (kredit-)mobilitás pályázat esetén!"}]
[null,null,null,"Harmadik helyre sorolt mobilitás"]
[]
["Fogadó intézmény:",{"$nulls":7},"Kar vagy tanszék:"]
[]
["Ország:",{"$nulls":7},"Város:"]
[]
["Cím:",{"$nulls":7},"ERASMUS-kód:"]
[]
["Weboldal:",{"$nulls":7},{"$f":"IF(E6=\"szakmai gyakorlat\",\"Munkavégzés nyelve:\",\"Oktatás nyelve:\")","v":"Oktatás nyelve:"}]
[]
["Partner kapcsolattartójának neve:",{"$nulls":7},"Pozíciója:"]
[]
["E-mail cím:",{"$nulls":7},"Telefonszám:"]
[]
["Mobilitás kezdete:",{"$nulls":7},"Mobilitás vége:"]
[]
[]
[]
[null,"Ellenőrző lista "]
[]
[null,"Pályázati űrlap kitöltve, aláírva 2 eredeti példányban + elektronikusan xls formátumban "]
[]
[null,null,"A kitöltött fájlt Vezeteknev_Keresztnev formában \"Mentés másként\"  elmentettem!"]
[null,"Igazolások, mellékletek (2 eredeti példány)"]
[]
[null,"Motivációs levél:"]
[]
[null,"Tanulmányi Osztály igazolása a két utolsó lezárt félév tanulmányi átlagáról:"]
[]
[null,"Nyelvtudást igazoló dokumentum: \n(A fogadó intézmény oktatási munkanyelvéből megfelelő  nyelvtudással rendelkezik.)"]
[]
[null,"OTDK, TDK, tudományos munka, kutatási szakmai tevékenység igazolása (opcionális):"]
[]
[null,{"$f":"IF(E6=\"szakmai gyakorlat\",\"Fogadólevél megléte:\",\"\")","v":""}]
{"$rows_empty":7}
[null,"Az oktatási szervezeti egység igazolása"]
[]
[null,"Alulírott a küldő oktatási szervezeti egység nevében igazolom, hogy a pályázó hallgató kiutazási szándékát szakmailag támogatjuk. "]
[]
[]
[null,"Név, beosztás:"]
[]
[null,null,"Kelt:",null,null,{"$f":"YEAR(TODAY())&\".\"&TEXT(MONTH(TODAY()),\"00\")&\".\"","v":"2014.09."}]
[{"$nulls":8},"az oktatási szervezeti egység képviseletében"]
[]
[]
[null,"Pályázó nyilatkozata"]
[null,"Alulírott aláírásommal hozzájárulok, hogy a küldő felsőoktatási intézmény és a támogatást biztosító Tempus Közalapítvány a személyes adataimat kezelje. A kezelt adatok köre minden olyan adatra kiterjed, amelyet a jelen pályázati eljárásban és dokumentációban megadok. Az adatkezelés célja az igénybe venni kívánt támogatás jogosultságának ellenőrzése, pénzügyi és szakmai nyomonkövetése, a felsőoktatási intézmény és a Tempus Közalapítvány beszámolási kötelezettségeinek teljesítéséhez szükséges jelentések és statisztikák elkészítése; információs anyagok készítése; kutatások, felmérések végzése. Az adatkezelés időtartama 10 év. Az adatokhoz hozzáférhetnek az adatbevitelt végzők; a felsőoktatási intézmény és a Tempus Közalapítvány illetékes munkatársai; a bírálati és monitoring folyamat szereplői; az ellenőrzésre jogosult és felügyeleti szervek; valamint anonim módon a program megvalósulását és hatásait elemző szakértők és kutatók. A személyes adatokat az adatkezelők védik különösen a jogosulatlan hozzáférés, megváltoztatás, illetéktelen továbbítás, nyilvánosságra hozatal, törlés vagy megsemmisítés, valamint a véletlen megsemmisülés és sérülés ellen.\nBüntetőjogi felelősségem tudatában kijelentem, hogy a pályázatban feltüntetett adatok a valóságnak megfelelnek. Valótlan adatközlés a pályázatból történő kizárást vonja maga után."]
[]
[null,null,"Kelt:",null,null,{"$f":"YEAR(TODAY())&\".\"&TEXT(MONTH(TODAY()),\"00\")&\".\"","v":"2014.09."}]
[{"$nulls":8},"hallgató aláírása"]

{"sheet":"adatok","index":1,"n_rows":304,"n_cols":11,"rows_kept":304,"cut":false,"hidden":true,"merged":[]}
["-",null,"2014-10-01",null,null,"igen","alapképzés (Bachelor, első szint)",null,null,null,"A1"]
["2014/2015",null,"2014-10-02",null,null,"nem","mesterképzés (Master, második szint)",null,null,null,"A2"]
["2013/2014",null,"2014-10-03",null,null,null,"doktori képzés (PhD, harmadik szint)",null,null,null,"B1"]
["2012/2013",null,"2014-10-04",null,null,null,"felsőfokú szakképzés",null,null,null,"B2"]
["2011/2012",null,"2014-10-05",{"$nulls":7},"C1"]
["2010/2011",null,"2014-10-06",{"$nulls":7},"C2"]
["2009/2010",null,"2014-10-07"]
["2008/2009",null,"2014-10-08"]
[null,null,"2014-10-09"]
[null,null,"2014-10-10"]
[null,null,"2014-10-11"]
[null,null,"2014-10-12"]
[null,null,"2014-10-13"]
[null,null,"2014-10-14"]
[null,null,"2014-10-15"]
[null,null,"2014-10-16"]
[null,null,"2014-10-17"]
[null,null,"2014-10-18"]
[null,null,"2014-10-19"]
[null,null,"2014-10-20"]
[null,null,"2014-10-21"]
[null,null,"2014-10-22"]
[null,null,"2014-10-23"]
[null,null,"2014-10-24"]
[null,null,"2014-10-25"]
[null,null,"2014-10-26"]
[null,null,"2014-10-27"]
[null,null,"2014-10-28"]
[null,null,"2014-10-29"]
[null,null,"2014-10-30"]
[null,null,"2014-10-31"]
[null,null,"2014-11-01"]
[null,null,"2014-11-02"]
[null,null,"2014-11-03"]
[null,null,"2014-11-04"]
[null,null,"2014-11-05"]
[null,null,"2014-11-06"]
[null,null,"2014-11-07"]
[null,null,"2014-11-08"]
[null,null,"2014-11-09"]
[null,null,"2014-11-10"]
[null,null,"2014-11-11"]
[null,null,"2014-11-12"]
[null,null,"2014-11-13"]
[null,null,"2014-11-14"]
[null,null,"2014-11-15"]
[null,null,"2014-11-16"]
[null,null,"2014-11-17"]
[null,null,"2014-11-18"]
[null,null,"2014-11-19"]
[null,null,"2014-11-20"]
[null,null,"2014-11-21"]
[null,null,"2014-11-22"]
[null,null,"2014-11-23"]
[null,null,"2014-11-24"]
[null,null,"2014-11-25"]
[null,null,"2014-11-26"]
[null,null,"2014-11-27"]
[null,null,"2014-11-28"]
[null,null,"2014-11-29"]
[null,null,"2014-11-30"]
[null,null,"2014-12-01","2014-12-01"]
[null,null,"2014-12-02","2014-12-02"]
[null,null,"2014-12-03","2014-12-03"]
[null,null,"2014-12-04","2014-12-04"]
[null,null,"2014-12-05","2014-12-05"]
[null,null,"2014-12-06","2014-12-06"]
[null,null,"2014-12-07","2014-12-07"]
[null,null,"2014-12-08","2014-12-08"]
[null,null,"2014-12-09","2014-12-09"]
[null,null,"2014-12-10","2014-12-10"]
[null,null,"2014-12-11","2014-12-11"]
[null,null,"2014-12-12","2014-12-12"]
[null,null,"2014-12-13","2014-12-13"]
[null,null,"2014-12-14","2014-12-14"]
[null,null,"2014-12-15","2014-12-15"]
[null,null,"2014-12-16","2014-12-16"]
[null,null,"2014-12-17","2014-12-17"]
[null,null,"2014-12-18","2014-12-18"]
[null,null,"2014-12-19","2014-12-19"]
[null,null,"2014-12-20","2014-12-20"]
[null,null,"2014-12-21","2014-12-21"]
[null,null,"2014-12-22","2014-12-22"]
[null,null,"2014-12-23","2014-12-23"]
[null,null,"2014-12-24","2014-12-24"]
[null,null,"2014-12-25","2014-12-25"]
[null,null,"2014-12-26","2014-12-26"]
[null,null,"2014-12-27","2014-12-27"]
[null,null,"2014-12-28","2014-12-28"]
[null,null,"2014-12-29","2014-12-29"]
[null,null,"2014-12-30","2014-12-30"]
[null,null,"2014-12-31","2014-12-31"]
[null,null,"2015-01-01","2015-01-01"]
[null,null,"2015-01-02","2015-01-02"]
[null,null,"2015-01-03","2015-01-03"]
[null,null,"2015-01-04","2015-01-04"]
[null,null,"2015-01-05","2015-01-05"]
[null,null,"2015-01-06","2015-01-06"]
[null,null,"2015-01-07","2015-01-07"]
[null,null,"2015-01-08","2015-01-08"]
[null,null,"2015-01-09","2015-01-09"]
[null,null,"2015-01-10","2015-01-10"]
[null,null,"2015-01-11","2015-01-11"]
[null,null,"2015-01-12","2015-01-12"]
[null,null,"2015-01-13","2015-01-13"]
[null,null,"2015-01-14","2015-01-14"]
[null,null,"2015-01-15","2015-01-15"]
[null,null,"2015-01-16","2015-01-16"]
[null,null,"2015-01-17","2015-01-17"]
[null,null,"2015-01-18","2015-01-18"]
[null,null,"2015-01-19","2015-01-19"]
[null,null,"2015-01-20","2015-01-20"]
[null,null,"2015-01-21","2015-01-21"]
[null,null,"2015-01-22","2015-01-22"]
[null,null,"2015-01-23","2015-01-23"]
[null,null,"2015-01-24","2015-01-24"]
[null,null,"2015-01-25","2015-01-25"]
[null,null,"2015-01-26","2015-01-26"]
[null,null,"2015-01-27","2015-01-27"]
[null,null,"2015-01-28","2015-01-28"]
[null,null,"2015-01-29","2015-01-29"]
[null,null,"2015-01-30","2015-01-30"]
[null,null,"2015-01-31","2015-01-31"]
[null,null,"2015-02-01","2015-02-01"]
[null,null,"2015-02-02","2015-02-02"]
[null,null,"2015-02-03","2015-02-03"]
[null,null,"2015-02-04","2015-02-04"]
[null,null,"2015-02-05","2015-02-05"]
[null,null,"2015-02-06","2015-02-06"]
[null,null,"2015-02-07","2015-02-07"]
[null,null,"2015-02-08","2015-02-08"]
[null,null,"2015-02-09","2015-02-09"]
[null,null,"2015-02-10","2015-02-10"]
[null,null,"2015-02-11","2015-02-11"]
[null,null,"2015-02-12","2015-02-12"]
[null,null,"2015-02-13","2015-02-13"]
[null,null,"2015-02-14","2015-02-14"]
[null,null,"2015-02-15","2015-02-15"]
[null,null,"2015-02-16","2015-02-16"]
[null,null,"2015-02-17","2015-02-17"]
[null,null,"2015-02-18","2015-02-18"]
[null,null,"2015-02-19","2015-02-19"]
[null,null,"2015-02-20","2015-02-20"]
[null,null,"2015-02-21","2015-02-21"]
[null,null,"2015-02-22","2015-02-22"]
[null,null,"2015-02-23","2015-02-23"]
[null,null,"2015-02-24","2015-02-24"]
[null,null,"2015-02-25","2015-02-25"]
[null,null,"2015-02-26","2015-02-26"]
[null,null,"2015-02-27","2015-02-27"]
[null,null,"2015-02-28","2015-02-28"]
[null,null,"2015-03-01","2015-03-01"]
[null,null,"2015-03-02","2015-03-02"]
[null,null,"2015-03-03","2015-03-03"]
[null,null,"2015-03-04","2015-03-04"]
[null,null,"2015-03-05","2015-03-05"]
[null,null,"2015-03-06","2015-03-06"]
[null,null,"2015-03-07","2015-03-07"]
[null,null,"2015-03-08","2015-03-08"]
[null,null,"2015-03-09","2015-03-09"]
[null,null,"2015-03-10","2015-03-10"]
[null,null,"2015-03-11","2015-03-11"]
[null,null,"2015-03-12","2015-03-12"]
[null,null,"2015-03-13","2015-03-13"]
[null,null,"2015-03-14","2015-03-14"]
[null,null,"2015-03-15","2015-03-15"]
[null,null,"2015-03-16","2015-03-16"]
[null,null,"2015-03-17","2015-03-17"]
[null,null,"2015-03-18","2015-03-18"]
[null,null,"2015-03-19","2015-03-19"]
[null,null,"2015-03-20","2015-03-20"]
[null,null,"2015-03-21","2015-03-21"]
[null,null,"2015-03-22","2015-03-22"]
[null,null,"2015-03-23","2015-03-23"]
[null,null,"2015-03-24","2015-03-24"]
[null,null,"2015-03-25","2015-03-25"]
[null,null,"2015-03-26","2015-03-26"]
[null,null,"2015-03-27","2015-03-27"]
[null,null,"2015-03-28","2015-03-28"]
[null,null,"2015-03-29","2015-03-29"]
[null,null,"2015-03-30","2015-03-30"]
[null,null,"2015-03-31","2015-03-31"]
[null,null,"2015-04-01","2015-04-01"]
[null,null,"2015-04-02","2015-04-02"]
[null,null,"2015-04-03","2015-04-03"]
[null,null,"2015-04-04","2015-04-04"]
[null,null,"2015-04-05","2015-04-05"]
[null,null,"2015-04-06","2015-04-06"]
[null,null,"2015-04-07","2015-04-07"]
[null,null,"2015-04-08","2015-04-08"]
[null,null,"2015-04-09","2015-04-09"]
[null,null,"2015-04-10","2015-04-10"]
[null,null,"2015-04-11","2015-04-11"]
[null,null,"2015-04-12","2015-04-12"]
[null,null,"2015-04-13","2015-04-13"]
[null,null,"2015-04-14","2015-04-14"]
[null,null,"2015-04-15","2015-04-15"]
[null,null,"2015-04-16","2015-04-16"]
[null,null,"2015-04-17","2015-04-17"]
[null,null,"2015-04-18","2015-04-18"]
[null,null,"2015-04-19","2015-04-19"]
[null,null,"2015-04-20","2015-04-20"]
[null,null,"2015-04-21","2015-04-21"]
[null,null,"2015-04-22","2015-04-22"]
[null,null,"2015-04-23","2015-04-23"]
[null,null,"2015-04-24","2015-04-24"]
[null,null,"2015-04-25","2015-04-25"]
[null,null,"2015-04-26","2015-04-26"]
[null,null,"2015-04-27","2015-04-27"]
[null,null,"2015-04-28","2015-04-28"]
[null,null,"2015-04-29","2015-04-29"]
[null,null,"2015-04-30","2015-04-30"]
[null,null,"2015-05-01","2015-05-01"]
[null,null,"2015-05-02","2015-05-02"]
[null,null,"2015-05-03","2015-05-03"]
[null,null,"2015-05-04","2015-05-04"]
[null,null,"2015-05-05","2015-05-05"]
[null,null,"2015-05-06","2015-05-06"]
[null,null,"2015-05-07","2015-05-07"]
[null,null,"2015-05-08","2015-05-08"]
[null,null,"2015-05-09","2015-05-09"]
[null,null,"2015-05-10","2015-05-10"]
[null,null,"2015-05-11","2015-05-11"]
[null,null,"2015-05-12","2015-05-12"]
[null,null,"2015-05-13","2015-05-13"]
[null,null,"2015-05-14","2015-05-14"]
[null,null,"2015-05-15","2015-05-15"]
[null,null,"2015-05-16","2015-05-16"]
[null,null,"2015-05-17","2015-05-17"]
[null,null,"2015-05-18","2015-05-18"]
[null,null,"2015-05-19","2015-05-19"]
[null,null,"2015-05-20","2015-05-20"]
[null,null,"2015-05-21","2015-05-21"]
[null,null,"2015-05-22","2015-05-22"]
[null,null,"2015-05-23","2015-05-23"]
[null,null,"2015-05-24","2015-05-24"]
[null,null,"2015-05-25","2015-05-25"]
[null,null,"2015-05-26","2015-05-26"]
[null,null,"2015-05-27","2015-05-27"]
[null,null,"2015-05-28","2015-05-28"]
[null,null,"2015-05-29","2015-05-29"]
[null,null,"2015-05-30","2015-05-30"]
[null,null,"2015-05-31","2015-05-31"]
[null,null,"2015-06-01","2015-06-01"]
[null,null,null,"2015-06-02"]
[null,null,null,"2015-06-03"]
[null,null,null,"2015-06-04"]
[null,null,null,"2015-06-05"]
[null,null,null,"2015-06-06"]
[null,null,null,"2015-06-07"]
[null,null,null,"2015-06-08"]
[null,null,null,"2015-06-09"]
[null,null,null,"2015-06-10"]
[null,null,null,"2015-06-11"]
[null,null,null,"2015-06-12"]
[null,null,null,"2015-06-13"]
[null,null,null,"2015-06-14"]
[null,null,null,"2015-06-15"]
[null,null,null,"2015-06-16"]
[null,null,null,"2015-06-17"]
[null,null,null,"2015-06-18"]
[null,null,null,"2015-06-19"]
[null,null,null,"2015-06-20"]
[null,null,null,"2015-06-21"]
[null,null,null,"2015-06-22"]
[null,null,null,"2015-06-23"]
[null,null,null,"2015-06-24"]
[null,null,null,"2015-06-25"]
[null,null,null,"2015-06-26"]
[null,null,null,"2015-06-27"]
[null,null,null,"2015-06-28"]
[null,null,null,"2015-06-29"]
[null,null,null,"2015-06-30"]
[null,null,null,"2015-07-01"]
[null,null,null,"2015-07-02"]
[null,null,null,"2015-07-03"]
[null,null,null,"2015-07-04"]
[null,null,null,"2015-07-05"]
[null,null,null,"2015-07-06"]
[null,null,null,"2015-07-07"]
[null,null,null,"2015-07-08"]
[null,null,null,"2015-07-09"]
[null,null,null,"2015-07-10"]
[null,null,null,"2015-07-11"]
[null,null,null,"2015-07-12"]
[null,null,null,"2015-07-13"]
[null,null,null,"2015-07-14"]
[null,null,null,"2015-07-15"]
[null,null,null,"2015-07-16"]
[null,null,null,"2015-07-17"]
[null,null,null,"2015-07-18"]
[null,null,null,"2015-07-19"]
[null,null,null,"2015-07-20"]
[null,null,null,"2015-07-21"]
[null,null,null,"2015-07-22"]
[null,null,null,"2015-07-23"]
[null,null,null,"2015-07-24"]
[null,null,null,"2015-07-25"]
[null,null,null,"2015-07-26"]
[null,null,null,"2015-07-27"]
[null,null,null,"2015-07-28"]
[null,null,null,"2015-07-29"]
[null,null,null,"2015-07-30"]
[null,null,null,"2015-07-31"]

{"sheet":"formai szakmai ertekeles","index":2,"n_rows":36,"n_cols":5,"rows_kept":36,"cut":false,"hidden":false,"merged":[[0,0,0,2],[2,0,2,1],[3,0,3,1],[4,0,4,1],[6,0,6,1],[1,0,1,1],[21,0,21,2],[22,0,22,2],[30,0,30,2],[32,0,32,2],[5,0,5,1],[15,0,15,1],[8,0,8,1],[9,0,9,1],[10,0,10,2],[12,0,12,2],[13,0,13,1],[14,0,14,1],[7,0,7,1]]}
["Formai ellenőrzés - az intézményi koordinátor tölti k!"]
[{"$f":"IF('palyazati urlap'!E10<>\"\",'palyazati urlap'!E10,\"\")","v":""}]
["Pályázati űrlap 2 eredeti példányban benyújtva:"]
["Pályázati űrlap elektronikusan benyújtva (.xlsx):"]
["Motivációs levél mellékelve:"]
["A pályázott tevékenység megvalósításakor a hallgató aktív jogviszonnyal rendelkezik:"]
["A megvalósítandó képzési programhoz kapcsolódó felsőoktatási tanulmányaiban \nlegalább két lezárt félévvel rendelkezik:"]
["Tanulmányi Osztály igazolása a két utolsó lezárt félév tanulmányi átlagáról mellékelve:"]
["Pályázatát tanszéke szakmailag támogatja:"]
[{"$f":"IF('palyazati urlap'!E6=\"Hallgatói (kredit-)mobilitás\",\"A fogadó intézmény(ek) oktatási munkanyelvéből megfelelő  nyelvtudással rendelkezik:\",\"A fogadó fél munkanyelvéből megfelelő  nyelvtudással rendelkezik:\")","v":"A fogadó fél munkanyelvéből megfelelő  nyelvtudással rendelkezik:"}]
[]
[{"$f":"IF(SUM(IF($C$3:$C$10=\"igen\",1,0))=7,\"A formai ellenőrzésnek a pályázat megfelelt.\",\"\")","v":""}]
[]
["A speciális intézményi feltételeknek megfelel:"]
["OTDK, TDK helyezés:"]
["Tudományos munka, kutatási szakmai tevékenység igazolása:"]
[null,"Súlyozott tanulmányi átlag az utolsó előtti lezárt félévben:",{"$f":"IF('palyazati urlap'!F40<>\"\",'palyazati urlap'!F40,\"\")","v":""}]
[null,"Súlyozott tanulmányi átlag az utolsó lezárt félévben:",{"$f":"IF('palyazati urlap'!F42<>\"\",'palyazati urlap'!F42,\"\")","v":""}]
[null,"SZAKÁTLAG az utolsó előtti lezárt félévben:"]
[null,"SZAKÁTLAG  az utolsó lezárt félévben:"]
[]
["Szakmai bírálat"]
[]
["Szempont","Pontszámok elvi alapja","Pontszám","Pont1","Pont2"]
["Tanulmányi átlag","0 pont: átlag<2,5 \n15 pont: 2,5<= átlag <szakátlag-0,1\n25 pont: szakátlag-0,1<=átlag<szakátlag\n30 pont: átlag=szakátlag \n35 pont: szakátlag<átlag<=szakátlag+0,2 \n40 pont: szakátlag+0,2<átlag",{"$f":"IF((PONT1=\"-\")*(PONT2=\"-\"),\"-\",IF((PONT1=\"-\"),PONT2,IF((PONT2=\"-\"),PONT1,ROUNDUP((PONT1+PONT2)/2,0))))","v":0},{"$f":"IF(ATLAG1=\"-\",\"-\",\n  IF((SZAKATLAG1<1)+(SZAKATLAG1>5),0,\n  IF(ATLAG1>4.8,40,\n  IF(ATLAG1<2.5,0,\n  IF(ATLAG1<(SZAKATLAG1-0.1),15,\n  IF(ATLAG1<SZAKATLAG1,25,\n  IF(ATLAG1=SZAKATLAG1,30,\n  IF(ATLAG1<=(SZAKATLAG1+0.2),35,40)\n)))))))","v":0},{"$f":"IF(ATLAG2=\"-\",\"-\",\n  IF((SZAKATLAG2<1)+(SZAKATLAG2>5),0,\n  IF(ATLAG2>4.8,40,\n  IF(ATLAG2<2.5,0,\n  IF(ATLAG2<(SZAKATLAG2-0.1),15,\n  IF(ATLAG2<SZAKATLAG2,25,\n  IF(ATLAG2=SZAKATLAG2,30,\n  IF(ATLAG2<=(SZAKATLAG2+0.2),35,40)\n)))))))","v":0}]
["Motivációs levél minősége","0 pont: A motivációs levél nem tartalmaz konkrétumokat, nincsenek célok meghatározva\n1-4 pont: Átlagosan megfogalmazott, kevés konkrétumot és célt tartalmaz\n5-7 pont: Átlagosan megfogalmazott, céljaiban általános, tartalmaz konkrétumot, összességében ígéretes elképzelés \n8-10 pont: Átgondolt, tartalmas motivációs levél, fogalmazásában és céljaiban igényes, konkrétumokat tartalmaz"]
["Tudományos munka, vagy azzal egyenértékű kutatási témában létrehozott alkotás, illetve szakmai tevékenység","5 pont:  Tudományos aktivitás, igazolás a tudományos munkáról, kutatási tevékenységről\n10 pont: Átlag feletti hallgatói tudományos aktivitás, igazolás a tevékenységről, OTDK helyezett (1-3.), TDK (1-3.) helyezett"]
["Műszaki- és természet-\ntudományos területen tanulók","10 pont: Műszaki és természettudományos területen tanul "]
[null,"összesen:",{"$f":"SUM(C25:C28)","v":0}]
[]
["Intézményi koordinátori nyilatkozat"]
[]
["Igazolom, hogy a hallgató által megjelölt alábbi fogadó intézményben az intézményi megállapodások alapján lehetséges a hallgató kiküldése:"]
[null,"Intézmény neve","Erasmus kód"]
[]
["aláírás"]

{"sheet":"ISCED-F kodok","index":3,"n_rows":134,"n_cols":2,"rows_kept":134,"cut":false,"hidden":false,"merged":[]}
[{"$f":"LEFT(B1,4)","v":"0110"},"0110: Education, not further defined"]
[{"$f":"LEFT(B2,4)","v":"0111"},"0111: Education science"]
["0112","0112: Training for pre-school teachers"]
["0113","0113: Teacher training without subject specialization"]
["0114","0114: Teacher training with subject specialization"]
["0119","0119: Education, not elsewhere classified"]
["0188","0188: Education, inter-disciplinary programmes"]
["0210","0210: Arts, not further defined"]
["0211","0211: Audio-visual techniques and media production"]
["0212","0212: Fashion, interior and industrial design"]
["0213","0213: Fine arts"]
["0214","0214: Handicrafts"]
["0215","0215: Music and performing arts"]
["0219","0219: Arts, not elsewhere classified"]
["0220","0220: Humanities (except languages), not further defined"]
["0221","0221: Religion and theology"]
["0222","0222: History and archaeology"]
["0223","0223: Philosophy and ethics"]
["0229","0229: Humanities (except languages), not elsewhere classified"]
["0230","0230: Languages, not further defined"]
["0231","0231: Language acquisition"]
["0232","0232: Literature and linguistics"]
["0239","0239: Languages, not elsewhere classified"]
["0288","0288: Arts and humanities, interdisciplinary programmes"]
["0310","0310: Social and behavioural sciences, not further defined"]
["0311","0311: Economics"]
["0312","0312: Political sciences and civics"]
["0313","0313: Psychology"]
["0314","0314: Sociology and cultural studies"]
["0319","0319: Social and behavioural sciences, not elsewhere classified"]
["0320","0320: Journalism and information, not further defined"]
["0321","0321: Journalism and reporting"]
["0322","0322: Library, information and archival studies"]
["0329","0329: Journalism and information, not elsewhere classified"]
["0388","0388: Social sciences, journalism and information, inter-disciplinary programmes"]
["0410","0410: Business and administration, not further defined"]
["0411","0411: Accounting and taxation"]
["0412","0412: Finance, banking and insurance"]
["0413","0413: Management and administration"]
["0414","0414: Marketing and advertising"]
["0415","0415: Secretarial and office work"]
["0416","0416: Wholesale and retail sales"]
["0417","0417: Work skills"]
["0419","0419: Business and administration"]
["0421","0421: Law"]
["0429","0429: Law, not elsewhere defined"]
["0488","0488: Business, administration and law, interdisciplinary programmes"]
["0510","0510: Biological and related sciences, not further defined"]
["0511","0511: Biology"]
["0512","0512: Biochemistry"]
["0519","0519: Biological and related sciences, not elsewhere classifed"]
["0520","0520: Environment, not further defined"]
["0521","0521: Environmental sciences"]
["0522","0522: Natural environments and wildlife"]
["0529","0529: Environment, not elsewhere classified"]
["0530","0530: Physical sciences, not further defined"]
["0531","0531: Chemistry"]
["0532","0532: Earth sciences"]
["0533","0533: Physics"]
["0539","0539: Physical sciences, not elsewhere classified"]
["0540","0540: Mathematics and statistics, not further defined"]
["0541","0541: Mathematics"]
["0542","0542: Statistics"]
["0549","0549: Mathematics and statistics, not elsewhere classified"]
["0588","0588: Natural sciences, mathematics and statistics, inter-disciplinary programmes"]
[{"$f":"LEFT(B66,4)","v":"0610"},"0610: Information and Communication Technologies"]
["0611","0611: Computer use"]
["0612","0612: Database and network design and administration"]
["0613","0613: Software and applications development and analysis"]
["0619","0619: Information and Communication Technologies"]
["0688","0688: Information and Communication Technologies"]
["0710","0710: Engineering and engineering trades, not further defined"]
["0711","0711: Chemical engineering and processes"]
["0712","0712: Environmental protection technology"]
["0713","0713: Electricity and energy"]
["0714","0714: Electronics and automation"]
["0715","0715: Mechanics and metal trades"]
["0716","0716: Motor vehicles, ships and aircraft"]
["0719","0719: Engineering and engineering trades, not elsewhere classified"]
["0720","0720: Manufacturing and processing, not further defined"]
["0721","0721: Food processing"]
["0722","0722: Materials (glass, paper, plastic and wood)"]
["0723","0723: Textiles (clothes, footwear and leather)"]
["0724","0724: Mining and extraction"]
["0729","0729: Manufacturing and processing, not elsewhere classified"]
["0730","0730: Architecture and construction, not further defined"]
["0731","0731: Architecture and town planning"]
["0732","0732: Building and civil engineering"]
["0739","0739: Architecture and construction, not elsewhere classified"]
["0788","0788: Engineering, manufacturing and construction, inter-disciplinary programmes"]
["0810","0810: Agriculture, not further defined"]
["0811","0811: Crop and livestock production"]
["0812","0812: Horticulture"]
["0819","0819: Agriculture, not elsewhere classified"]
["0821","0821: Forestry"]
["0829","0829: Forestry, not elsewhere classified"]
["0831","0831: Fisheries"]
["0839","0839: Fisheries, not elsewhere classified"]
["0841","0841: Veterinary"]
["0849","0849: Veterinary, not elsewhere classified"]
["0888","0888: Agriculture, forestry, fisheries, veterinary, inter-disciplinary programmes"]
["0910","0910: Health, not further defined"]
["0911","0911: Dental studies"]
["0912","0912: Medicine"]
["0913","0913: Nursing and midwifery"]
["0914","0914: Medical diagnostic and treatment technology"]
["0915","0915: Therapy and rehabilitation"]
["0916","0916: Pharmacy"]
["0917","0917: Traditional and complementary medicine and therapy"]
["0919","0919: Health, not elsewhere classified"]
["0920","0920: Welfare, not further defined"]
["0921","0921: Care of the elderly and of disabled adults"]
["0922","0922: Child care and youth services"]
["0923","0923: Social work and counselling"]
["0929","0929: Welfare, not elsewhere classified"]
["0988","0988: Health and Welfare, inter-disciplinary programmes"]
["1010","1010: Personal services, not further defined"]
["1011","1011: Domestic services"]
["1012","1012: Hair and beauty services"]
["1013","1013: Hotel, restaurants and catering"]
["1014","1014: Sports"]
["1015","1015: Travel, tourism and leisure"]
["1019","1019: Personal services, not elsewhere classified"]
["1020","1020: Hygiene and occupational health services, not further defined"]
["1021","1021: Community sanitation"]
["1022","1022: Occupational health and safety"]
["1029","1029: Hygiene and occupational health services, not elsewhere classified"]
["1030","1030: Security services, not further defined"]
["1031","1031: Military and defence"]
[{"$f":"LEFT(B130,4)","v":"1032"},"1032: Protection of persons and property"]
["1039","1039: Security services, not elsewhere classified"]
["1041","1041: Transport services"]
["1049","1049: Transport services, not elsewhere classified"]
["1088","1088: Services, inter-disciplinary programmes"]